{"text_format":"1","workbook":"xlsx","n_sheets":9,"sheets":["Facility","Language","Lang","Form1","Datasheet","Summary","Headings","Lists","Notes"],"not_rendered":{"charts":0,"images":3,"macros":1,"external_links":7,"defined_names":253,"comments":0,"pivot_tables":0},"unopened":[],"bounds":{"document_bytes":16777216,"sheet_cells":100000,"rows_first":2000,"rows_last":500,"rows_between":2000,"halvings":0,"cell_chars":16384,"cell_head_chars":4096},"cells_cut":0,"cells_raw":0,"read":"whole","date_system":"1900"}

{"sheet":"Facility","index":0,"n_rows":205,"n_cols":20,"rows_kept":205,"cut":false,"hidden":true,"merged":[]}
[]
[]
["Type of Facility",null,null,"Application Type",null,null,"Attachment","Pièces jointes","Panel","Palier"]
["Care and/or Treatment",null,null,null,null,null,null,null,null,null,null,"Soins et/ou traitement","GLG 20(2).3"]
["Community-Based Youth Justice Programs",null,"GLG 20(2).3","Renewal","Renouvellement",null,"Agreement & Application Attachment","Entente et demande","Elementary","Élémentaire",null,"Programmes d'enseignement et de traitement améliorés"]
["Corrections (18-21 yrs.)",null,"GLG 20(2).5","Liaison/Administration","Liaison/Administration",null,"Agreement & Application Attachment & Program Description","Entente, Demande et description du programme","Secondary","Secondaire",null,"Garde et détention en milieu ouvert",null,null,null,null,null,"Nouvelle-expansion",null,"Agreement & Application Attachment & Program Description"]
["Enhanced Educational Treatment Programs",null,"GLG 20(2).9","New","Nouvelle",null,"Agreement & Program Description","Entente et description du programme",null,null,null,"Garde et détention en milieu fermé","GLG 20(2).5",null,null,"Program change",null,null,null,"Entente et demande en pièces jointes et description du programme"]
["Open Custody & Detention",null,"GLG 20(2).10","Closed","Fermée",null,"Agreement Only","Entente seulement",null,null,null,"Programme communautaire de justice pour les jeunesse","GLG 20(2).9"]
["Secure Custody & Detention",null,"GLG 20(2).10",null,null,null,"Application Attachment & Program Description","Demande et description du programme seulement","Yes","Oui",null,"Services correctionnels (18 à 21 ans)","GLG 20(2).10",null,null,"yes","oui"]
[null,null,"GLG 20(2).4",null,null,null,"Application Attachment Only","Demande seulement","No","Non",null,null,"GLG 20(2).10",null,null,"no","non"]
[null,null,"GLG 20(2).7",null,null,null,"Program Description Only","Description du programme seulement",null,null,null,null,"GLG 20(2).4"]
[null,null,null,null,null,null,null,null,"Previously Submitted","Previously Submitted (FR)",null,null,"GLG 20(2).7"]
[null,null,"GLG 20(2).1",null,null,null,null,null,"New or Updated Program Description for 2016-17","Description nouvelle ou mise à jour pour 2016-2017"]
[null,null,"GLG 20(2).3",null,null,null,null,null,"New Program Description for 2016-17","Nouvelle description de programme pour 2016-2017",null,null,"GLG 20(2).1"]
[null,null,null,null,null,null,null,null,null,null,null,null,"GLG 20(2).3"]
["DSB No.","Pub/Sep","Eng./French","Board Name","DSB No.","Board Name","Alpha Board Name",null,"Status",null,"Statut",null,"Regional Office"]
[1,"Public  ","English","DSB Ontario North East                                        ",28002,"District School Board Ontario North East","Algoma DSB                                                    "]
[2,"Public  ","English","Algoma DSB                                                    ",28010,"Algoma District School Board","Algonquin and Lakeshore Catholic DSB                          ",null,"Approved as submitted","A","Acceptée avec révisions","R","Central Region"]
[3,"Public  ","English","Rainbow DSB                                                   ",28029,"Rainbow District School Board","Avon Maitland DSB                                             ",null,"Approved with revision","R","Acceptée telle que soumise","A","West Region"]
[4,"Public  ","English","Near North DSB                                                ",28037,"Near North District School Board","Bluewater DSB                                                 ",null,"Closed","C","Fermé","F","East Region"]
[5.0999999999999996,"Public  ","English","Keewatin-Patricia DSB                                         ",28045,"Keewatin-Patricia District School Board","Brant Haldimand Norfolk Catholic DSB                          ",null,"Denied","D","Refusée","REF","North Region- NE"]
[5.2,"Public  ","English","Rainy River DSB                                               ",28053,"Rainy River District School Board","Bruce-Grey Catholic DSB                                       ",null,"Withdrawn","W","Retirée","RET","North Region- NW"]
[6.1,"Public  ","English","Lakehead DSB                                                  ",28061,"Lakehead District School Board","Catholic DSB of Eastern Ontario                               ",null,"Year",null,null,null,"Toronto Region"]
[6.2,"Public  ","English","Superior-Greenstone DSB                                       ",28070,"Superior-Greenstone District School Board","Conseil scolaire Viamonde                                ",null,"2015-2016",null,"September-June","septembre-juin"]
[7,"Public  ","English","Bluewater DSB                                                 ",66001,"Bluewater District School Board","CSD catholique Centre-Sud                                     ",null,"2016-2017",null,"July-August","juillet-août","2021-22"]
[8,"Public  ","English","Avon Maitland DSB                                             ",66010,"Avon Maitland District School Board","CSD catholique de l'Est ontarien                              ",null,"2017-2018",null,null,null,"2022-23"]
[9,"Public  ","English","Greater Essex County DSB                                      ",66028,"Greater Essex County District School Board","CSD catholique des Aurores boréales                           ",null,"2018-2019",null,null,null,"2023-24"]
[10,"Public  ","English","Lambton Kent DSB                                              ",66036,"Lambton Kent District School Board","CSD catholique des Grandes Riviéres                           ",null,null,null,null,null,"2024-25"]
[11,"Public  ","English","Thames Valley DSB                                             ",66044,"Thames Valley District School Board","CSD catholique du Centre-Est de l'Ontario                     ",null,null,null,"English","Anglais","2025-26"]
[12,"Public  ","English","Toronto DSB                                                   ",66052,"Toronto District School Board","CSD catholique du Nouvel-Ontario                              ",null,null,null,"French","Français"]
[13,"Public  ","English","Durham DSB                                                    ",66060,"Durham District School Board","CSD catholique Franco-Nord                                    "]
[14,"Public  ","English","Kawartha Pine Ridge DSB                                       ",66079,"Kawartha Pine Ridge District School Board","Conseil scolaire catholique Providence                       ",null,null,null,"JK and/or SK","Mat. et jardin d'enfants"]
[15,"Public  ","English","Trillium Lakelands DSB                                        ",66087,"Trillium Lakelands District School Board","CSD des écoles publiques de l'Est de l'Ontario                ",null,null,null,"Primary","Primaire"]
[16,"Public  ","English","York Region DSB                                               ",66095,"York Region District School Board","CSD du Grand Nord de l'Ontario                                ",null,null,null,"Junior","Moyen"]
[17,"Public  ","English","Simcoe County DSB                                             ",66109,"Simcoe County District School Board","CSD du Nord-Est de l'Ontario                                  ",null,null,null,"Primary and Junior","Primaire et moyen"]
[18,"Public  ","English","Upper Grand DSB                                               ",66117,"Upper Grand District School Board","DSB of Niagara                                                ",null,null,null,"Intermediate, 7-8","Intermédiaire, 7-8"]
[19,"Public  ","English","Peel DSB                                                      ",66125,"Peel District School Board","DSB Ontario North East                                        ",null,null,null,"Secondary","Secondaire"]
[20,"Public  ","English","Halton DSB                                                    ",66133,"Halton District School Board","Dufferin-Peel Catholic DSB                                    "]
[21,"Public  ","English","Hamilton-Wentworth DSB                                        ",66141,"Hamilton-Wentworth District School Board","Durham Catholic DSB                                           ",null,null,null,"Date","Date_F"]
[22,"Public  ","English","DSB of Niagara                                                ",66150,"District School Board of Niagara","Durham DSB                                                    ",null,null,null,"March 2018","mars 2018"]
[23,"Public  ","English","Grand Erie DSB                                                ",66168,"Grand Erie District School Board","English-language #38 Catholic DSB",null,null,null,"October 2018","octobre 2018"]
[24,"Public  ","English","Waterloo Region DSB                                           ",66176,"Waterloo Region District School Board","Grand Erie DSB                                                "]
[25,"Public  ","English","Ottawa-Carleton DSB                                           ",66184,"Ottawa-Carleton District School Board","Greater Essex County DSB                                      ",null,null,null,"Elem.","Élém."]
[26,"Public  ","English","Upper Canada DSB                                              ",66192,"Upper Canada District School Board","Halton Catholic DSB                                           ",null,null,null,"Sec.","Sec."]
[27,"Public  ","English","Limestone DSB                                                 ",66206,"Limestone District School Board","Halton DSB                                                    ",null,null,null,"Elem./Sec.","Élém./Sec."]
[28,"Public  ","English","Renfrew County DSB                                            ",66214,"Renfrew County District School Board","Hamilton-Wentworth Catholic DSB                               "]
[29,"Public  ","English","Hastings and Prince Edward DSB                                ",66222,"Hastings & Prince Edward District School Board","Hamilton-Wentworth DSB                                        ",null,null,null,"JK","Maternelle"]
[30.1,"Separate","English","Northeastern Catholic DSB                                     ",29009,"Northeastern Catholic District School Board","Hastings and Prince Edward DSB                                ",null,null,null,"SK","Jardin d'enfants."]
[30.2,"Separate","English","Nipissing-Parry Sound Catholic DSB                            ",29017,"Nipissing-Parry Sound Catholic District School Board","Huron-Perth Catholic DSB                                      ",null,null,null,1,1]
[31,"Separate","English","Huron-Superior Catholic DSB                                   ",29025,"Huron-Superior Catholic District School Board","Huron-Superior Catholic DSB                                   ",null,null,null,2,2]
[32,"Separate","English","Sudbury Catholic DSB                                          ",29033,"Sudbury Catholic District School Board","Kawartha Pine Ridge DSB                                       ",null,null,null,3,3]
[33.1,"Separate","English","Northwest Catholic DSB                                        ",29041,"Northwest Catholic District School Board","Keewatin-Patricia DSB                                         ",null,null,null,4,4]
[33.200000000000003,"Separate","English","Kenora Catholic DSB                                           ",29050,"Kenora Catholic District School Board","Kenora Catholic DSB                                           ",null,null,null,5,5]
[34.1,"Separate","English","Thunder Bay Catholic DSB                                      ",29068,"Thunder Bay Catholic District School Board","Lakehead DSB                                                  ",null,null,null,6,6]
[34.200000000000003,"Separate","English","Superior North Catholic DSB                                   ",29076,"Superior North Catholic District School Board","Lambton Kent DSB                                              ",null,null,null,7,7]
[35,"Separate","English","Bruce-Grey Catholic DSB                                       ",67008,"Bruce-Grey Catholic District School Board","Limestone DSB                                                 ",null,null,null,8,8]
[36,"Separate","English","Huron-Perth Catholic DSB                                      ",67016,"Huron Perth Catholic District School Board","Near North DSB                                                ",null,null,null,9,9]
[37,"Separate","English","Windsor-Essex Catholic DSB                                    ",67024,"Windsor-Essex Catholic District School Board","Niagara Catholic DSB                                          ",null,null,null,10,10]
[38,"Separate","English","English-language #38 Catholic DSB",67032,"English-language #38 Catholic District School Board","Nipissing-Parry Sound Catholic DSB                            ",null,null,null,11,11]
[39,"Separate","English","St. Clair Catholic DSB                                        ",67040,"St Clair Catholic District School Board","Northeastern Catholic DSB                                     ",null,null,null,12,12]
[40,"Separate","English","Toronto Catholic DSB                                          ",67059,"Toronto Catholic District School Board","Northwest Catholic DSB                                        "]
[41,"Separate","English","Peterborough V.N.C. Catholic DSB                              ",67067,"Peterborough Victoria Northumberland & Clarington Catholic District School Board","Ottawa Catholic DSB                                  "]
[42,"Separate","English","York Catholic DSB                                             ",67075,"York Catholic District School Board","Ottawa-Carleton DSB                                           ",null,null,null,"Facility","L'établissement"]
[43,"Separate","English","Dufferin-Peel Catholic DSB                                    ",67083,"Dufferin-Peel Catholic District School Board","Peel DSB                                                      ",null,null,null,"Other","Autre"]
[44,"Separate","English","Simcoe Muskoka Catholic DSB                                   ",67091,"Simcoe Muskoka Catholic District School Board","Peterborough V.N.C. Catholic DSB                              "]
[45,"Separate","English","Durham Catholic DSB                                           ",67105,"Durham Catholic District School Board","Rainbow DSB                                                   "]
[46,"Separate","English","Halton Catholic DSB                                           ",67113,"Halton Catholic District School Board","Rainy River DSB                                               "]
[47,"Separate","English","Hamilton-Wentworth Catholic DSB                               ",67121,"Hamilton-Wentworth Catholic District School Board","Renfrew County Catholic DSB                                   "]
[48,"Separate","English","Wellington Catholic DSB                                       ",67130,"Wellington Catholic District School Board","Renfrew County DSB                                            "]
[49,"Separate","English","Waterloo Catholic DSB                                         ",67148,"Waterloo Catholic District School Board","Simcoe County DSB                                             ",null,"Status for summary"]
[50,"Separate","English","Niagara Catholic DSB                                          ",67156,"Niagara Catholic District School Board","Simcoe Muskoka Catholic DSB                                   "]
[51,"Separate","English","Brant Haldimand Norfolk Catholic DSB                          ",67164,"Brant/Haldimand-Norfolk Catholic District School Board","St. Clair Catholic DSB                                        ",null,"Approved as submitted","Approved","Acceptée avec révisions","Acceptée"]
[52,"Separate","English","Catholic DSB of Eastern Ontario                               ",67172,"Catholic District School Board of Eastern Ontario","Sudbury Catholic DSB                                          ",null,"Approved with revision","Approved","Acceptée telle que soumise","Acceptée"]
[53,"Separate","English","Ottawa Catholic DSB                                  ",67180,"Ottawa Catholic District School Board","Superior North Catholic DSB                                   ",null,"Denied","Denied","Refusée","Refusée"]
[54,"Separate","English","Renfrew County Catholic DSB                                   ",67199,"Renfrew County Catholic District School Board","Superior-Greenstone DSB                                       ",null,"Withdrawn","Withdrawn","Retirée","Retirée"]
[55,"Separate","English","Algonquin and Lakeshore Catholic DSB                          ",67202,"Algonquin & Lakeshore Catholic District School Board","Thames Valley DSB                                             "]
[56,"Public  ","French","CSD du Nord-Est de l'Ontario                                  ",28100,"Conseil scolaire de district du Nord-Est de l'Ontario","Thunder Bay Catholic DSB                                      "]
[57,"Public  ","French","CSD du Grand Nord de l'Ontario                                ",28118,"Conseil scolaire de district du Grand Nord de l'Ontario","Toronto Catholic DSB                                          "]
[58,"Public  ","French","Conseil scolaire Viamonde                                ",66303,"Conseil scolaire Viamonde","Toronto DSB                                                   "]
[59,"Public  ","French","CSD des écoles publiques de l'Est de l'Ontario                ",66311,"Conseil des écoles publiques de l'Est de l'Ontario","Trillium Lakelands DSB                                        "]
[60.1,"Separate","French","CSD catholique des Grandes Riviéres                           ",29106,"Conseil scolaire de district catholique des Grandes Rivières","Upper Canada DSB                                              "]
[60.2,"Separate","French","CSD catholique Franco-Nord                                    ",29114,"Conseil scolaire de district catholique Franco-Nord","Upper Grand DSB                                               ",null,null,null,"Average of 210 mins or more per day","Durée moyenne de 210 minutes ou plus par jour"]
[61,"Separate","French","CSD catholique du Nouvel-Ontario                              ",29122,"Conseil scolaire de district catholique du Nouvel-Ontario","Waterloo Catholic DSB                                         ",null,null,null,"Average of less than 210 minutes per day","Durée moyenne de moins de 210 minutes par jour"]
[62,"Separate","French","CSD catholique des Aurores boréales                           ",29130,"Conseil scolaire de district catholique des Aurores Boréales","Waterloo Region DSB                                           ",null,null,null,"Independent Study","Pour des études personnelles"]
[63,"Separate","French","Conseil scolaire catholique Providence                       ",67300,"Conseil scolaire catholique Providence                       ","Wellington Catholic DSB                                       ",null,null,null,"Combination of the above","Combinaison des options ci-dessus"]
[64,"Separate","French","CSD catholique Centre-Sud                                     ",67318,"Conseil scolaire de district catholique Centre-Sud","Windsor-Essex Catholic DSB                                    ",null,null,null,"Other","Autres"]
[65,"Separate","French","CSD catholique de l'Est ontarien                              ",67326,"Conseil scolaire de district catholique de l'Est Ontarien","York Catholic DSB                                             "]
[66,"Separate","French","CSD catholique du Centre-Est de l'Ontario                     ",67334,"Conseil scolaire de district catholique du Centre-Est de l'Ontario","York Region DSB                                               "]
[]
[]
[]
[1,"DSB Ontario North East                                        ",1,"English"]
[2,"Algoma DSB                                                    ",2,"English"]
[3,"Rainbow DSB                                                   ",3,"English"]
[4,"Near North DSB                                                ",4,"English"]
[5.0999999999999996,"Keewatin-Patricia DSB                                         ",5.0999999999999996,"English"]
[5.2,"Rainy River DSB                                               ",5.2,"English"]
[6.1,"Lakehead DSB                                                  ",6.1,"English"]
[7,"Bluewater DSB                                                 ",7,"English"]
[8,"Avon Maitland DSB                                             ",8,"English"]
[9,"Greater Essex County DSB                                      ",9,"English"]
[10,"Lambton Kent DSB                                              ",10,"English"]
[11,"Thames Valley DSB                                             ",11,"English"]
["12_Admin","Toronto DSB",12,"English"]
["12_Elem","Toronto DSB",12,"English"]
["12_Sec_A","Toronto DSB",12,"English"]
["12_Sec_B","Toronto DSB",12,"English"]
[13,"Durham DSB                                                    ",13,"English"]
[14,"Kawartha Pine Ridge DSB                                       ",14,"English"]
[15,"Trillium Lakelands DSB                                        ",15,"English"]
[16,"York Region DSB                                               ",16,"English"]
[17,"Simcoe County DSB                                             ",17,"English"]
[18,"Upper Grand DSB                                               ",18,"English"]
[19,"Peel DSB                                                      ",19,"English"]
["19_Roy_ McMurtry","Peel DSB                                                      ",19,"English"]
[20,"Halton DSB                                                    ",20,"English"]
[21,"Hamilton-Wentworth DSB                                        ",21,"English"]
[22,"DSB of Niagara                                                ",22,"English"]
[23,"Grand Erie DSB                                                ",23,"English"]
[24,"Waterloo Region DSB                                           ",24,"English"]
[25,"Ottawa-Carleton DSB                                           ",25,"English"]
[26,"Upper Canada DSB                                              ",26,"English"]
[27,"Limestone DSB                                                 ",27,"English"]
[28,"Renfrew County DSB                                            ",28,"English"]
[29,"Hastings and Prince Edward DSB                                ",29,"English"]
[30.2,"Nipissing-Parry Sound Catholic DSB                            ",30.2,"English"]
[31,"Huron-Superior Catholic DSB                                   ",31,"English"]
[32,"Sudbury Catholic DSB                                          ",32,"English"]
[33.200000000000003,"Kenora Catholic",33.200000000000003,"English"]
[34.1,"Thunder Bay Catholic DSB                                      ",34.1,"English"]
[36,"Huron-Perth Catholic DSB                                      ",36,"English"]
[37,"Windsor-Essex Catholic DSB                                    ",37,"English"]
[38,"English-language #38 Catholic DSB",38,"English"]
[39,"St. Clair Catholic DSB                                        ",39,"English"]
[40,"Toronto Catholic DSB                                          ",40,"English"]
[41,"Peterborough V.N.C. Catholic DSB                              ",41,"English"]
[42,"York Catholic DSB                                             ",42,"English"]
[43,"Dufferin-Peel Catholic DSB                                    ",43,"English"]
[44,"Simcoe Muskoka Catholic DSB                                   ",44,"English"]
[47,"Hamilton-Wentworth Catholic DSB                               ",47,"English"]
[49,"Waterloo Catholic DSB                                         ",49,"English"]
[50,"Niagara Catholic DSB                                          ",50,"English"]
[52,"Catholic DSB of Eastern Ontario                               ",52,"English"]
[53,"Ottawa Catholic DSB                                  ",53,"English"]
[54,"Renfrew County Catholic DSB                                   ",54,"English"]
[55,"Algonquin and Lakeshore Catholic DSB                          ",55,"English"]
[56,"CSD du Nord-Est de l'Ontario                                  ",56,"French"]
[57,"CSD du Grand Nord de l'Ontario                                ",57,"French"]
[58,"Conseil scolaire Viamonde                                       ",58,"French"]
[59,"CSD des écoles publiques de l'Est de l'Ontario                ",59,"French"]
[60.1,"CSD catholique des Grandes Riviéres                           ",60.1,"French"]
[60.2,"CSD catholique Franco-Nord                                    ",60.2,"French"]
[61,"CSD catholique du Nouvel-Ontario                              ",61,"French"]
[63,"Conseil scolaire catholique Providence                       ",63,"French"]
[64,"CSD catholique Centre-Sud                                     ",64,"French"]
[65,"CSD catholique de l'Est ontarien                              ",65,"French"]
[]
[]
["Ministry","Ministère"]
["Children and Youth Services","Services à l'enfance et à la jeunesse"]
["Community and Social Services","Services sociaux et communautaires"]
["Community Safety and Correctional Services","Sécurité communautaire et des Services correctionnels"]
["Health and Long-Term Care","Santé et des Soins de longue durée"]
["Multiple Ministries","Plusieurs ministères",null,null,null,null,"Care and Treatment Focus","Setting",null,null,"Setting_F"]
[null,null,null,null,null,1,"Treatment for students demonstrating severe social and/or emotional and/or behavioural issues","Young Parent Resource Centres: Day Treatment",null,null,"Centres de ressources pour jeunes parents : programme de jour"]
[null,null,null,null,null,null,null,"Young Parent Resource Centres: Residential",null,null,"Centres de ressources pour jeunes parents : programme résidentiel"]
["Care and/or treatment for students identified with one or more category of exceptionality and demonstrating severe social and/or emotional issues and/or learning needs","Setting2",null,"Justice pour la jeunesse ou services correctionnels","Setting5_F",null,null,"Young Parent Resource Centres: Day Treatment and Residential ",null,null,"Centres de ressources pour jeunes parents : programme de jour et résidentiel "]
["Treatment for students demonstrating severe social and/or emotional and/or behavioural issues","Setting1",null,"Soins et/ou traitement pour élèves identifiés avec plus d’une catégorie d'anomalies et démontrant de graves problèmes émotifs, sociaux et d’apprentissage","Setting2_F",null,null,"Other Care and/or Treatment Programs: Day Treatment",null,null,"Autres programmes de soins et/ou de traitement : programme de jour"]
["Treatment for students requiring medical and/or surgical services in a hospital setting","Setting4",null,"Traitement pour élèves manifestant des problèmes sociaux, émotifs ou de comportement graves","Setting1_F",null,null,"Other Care and/or Treatment Programs: Residential ",null,null,"Autres programmes de soins et/ou de traitement : programme résidentiel"]
["Treatment for students requiring mental health and/or addiction services","Setting3",null,"Traitement pour élèves nécessitant des services de santé mentale ou pour les dépendances","Setting3_F",null,null,"Other Care and/or Treatment Programs: Day Treatment and Residential ",null,null,"Autres programmes de soins et/ou de traitement : programme de jour et résidentiel"]
["Youth Justice or Corrections","Setting5",null,"Traitement pour élèves nécessitant des services médicaux ou chirurgicaux dans un milieu hospitalier","Setting4_F"]
[null,null,null,null,null,2,"Care and/or treatment for students identified with one or more category of exceptionality and demonstrating severe social and/or emotional issues and/or learning needs","Day Treatment ",null,null,"Programme de jour "]
[null,null,null,null,null,null,null,"Residential",null,null,"Programme résidentiel"]
[null,null,null,null,null,null,null,"Day Treatment and Residential",null,null,"Programme de jour et résidential"]
["Directly operated","Géré directement par"]
["Transfer Payment Agency","Organisme de paiment de transfert",null,null,null,3,"Treatment for students requiring mental health and/or addiction services","Mental Health: Day Treatment",null,null,"Santé mentale : programme de jour"]
[null,null,null,null,null,null,null,"Mental Health: Residential",null,null,"Santé mentale : programme résidentiel"]
[null,null,null,null,null,null,null,"Mental Health: Hospital",null,null,"Santé mentale : programme en milieu hospitalier"]
["Day Treatment Only","programme de jour",null,null,null,null,null,"Mental Health: Day Treatment and Residential",null,null,"Santé mentale : centre de traitement de jour et résidentiel"]
["Residential Only","programme résidentiel",null,null,null,null,null,"Mental Health: Day Treatment and Hospital",null,null,"Santé mentale : programme de jour et en milieu hospitalier"]
["Residential/Day Treatment","programme de jour et résidentiel",null,null,null,null,null,"Mental Health: Residential and Hospital",null,null,"Santé mentale : programme résidentiel et en milieu hospitalier"]
["Hospital","programme en mileiu hospitalier",null,null,null,null,null,"Mental Health: Day Treatment, Residential and Hospital",null,null,"Santé mentale : programme de jour, résidentiel et en milieu hospitalier"]
[null,null,null,null,null,null,null,"Addictions: Day Treatment",null,null,"Dépendances : programme de jour"]
[null,null,null,null,null,null,null,"Addictions: Residential",null,null,"Dépendances : programme résidentiel"]
["Ministries",null,null,null,null,null,null,"Addictions: Hospital",null,null,"Dépendances : programme en milieu hospitalier"]
["Children, Community and Social Services","Services à l'enfance et Services sociaux et communautaires",null,null,null,null,null,"Addictions: Day Treatment and Residential",null,null,"Dépendances : programme de jour et résidentiel"]
["Health","Santé",null,null,null,null,null,"Addictions: Day Treatment and Hospital ",null,null,"Dépendances : programme de jour et en milieu hospitalier"]
["Solicitor General","Solliciteur général",null,null,null,null,null,"Addictions: Residential and Hospital",null,null,"Dépendances : programme résidentiel et en milieu hospitalier"]
["Other","Autre",null,null,null,null,null,"Addictions: Day Treatment, Residential and Hospital",null,null,"Dépendances : programme de jour, résidentiel et en milieu hospitalier"]
[null,null,null,null,null,null,null,"Mental Health and Addictions: Day Treatment",null,null,"Santé mentale et dépendances : programme de jour"]
[null,null,null,null,null,null,null,"Mental Health and Addictions: Residential",null,null,"Santé mentale et dépendances : programme résidentiel"]
[null,null,null,null,null,null,null,"Mental Health and Addictions: Hospital",null,null,"Santé mentale et dépendances : programmes en milieu hospitalier"]
[null,null,null,null,null,null,null,"Mental Health and Addictions: Day Treatment and Residential ",null,null,"Santé mentale et dépendances : programme de jour et résidentiel"]
[null,null,null,null,null,null,null,"Mental Health and Addictions: Day Treatment and Hospital",null,null,"Santé mentale et dépendances : programme de jour et en milieu hospitalier"]
[null,null,null,null,null,null,null,"Mental Health and Addictions: Residential and Hospital",null,null,"Santé mentale et dépendances : programme résidentiel et en milieu hospitalier"]
[null,null,null,null,null,null,null,"Mental Health and Addictions: Day Treatment, Residential and Hospital",null,null,"Santé mentale et dépendances : programme de jour, résidentiel et en milieu hospitalier"]
[null,null,null,null,null,null,null,"Young Parent Resource Centres: Day Treatment",null,null,"Centres de ressources pour jeunes parents : programme de jour"]
[null,null,null,null,null,null,null,"Young Parent Resource Centres: Residential",null,null,"Centres de ressources pour jeunes parents : programme résidentiel"]
[null,null,null,null,null,null,null,"Young Parent Resource Centres: Day Treatment and Residential ",null,null,"Centres de ressources pour jeunes parents : programme de jour et résidentiel "]
[]
[null,null,null,null,null,4,"Treatment for students requiring medical and/or surgical services in a hospital setting","Outpatient ",null,null,"Pour patients en consultation externe"]
[null,null,null,null,null,null,null,"Inpatient",null,null,"Pour patients hospitalisés"]
[null,null,null,null,null,null,null,"Outpatient and Inpatient",null,null,"Pour patients en consultation externe et patients hospitalisés"]
[]
[null,null,null,null,null,5,"Youth Justice or Corrections","Youth Justice or Corrections",null,null,"Justice pour les jeunesse ou Services correctionnels"]

{"sheet":"Language","index":1,"n_rows":0,"n_cols":0,"rows_kept":0,"cut":false,"hidden":true,"merged":[]}

{"sheet":"Lang","index":2,"n_rows":21,"n_cols":6,"rows_kept":21,"cut":false,"hidden":false,"merged":[[4,5,4,11],[5,5,5,11]]}
[]
[]
[]
[]
[]
[]
[]
[null,null,null,"Note: Please open the file called flatfile.xls before clicking on the load button or the macro will NOT work."]
[null,null,null,"Note: Veuillez ouvrir le fichier \"flatfile.xls\" avant d'appuyer sur le bouton \"load\" sinon la macro ne fonctionnera PAS."]
[]
[]
[null,null,null,"Select Board No./\nSélectionner le no. du conseil"]
[null,null,null,"Name of Board/\n Nom du conseil",null,{"$f":"IF($F$12=\"\",\"\",VLOOKUP($F$12,Facility!$A$92:$D$152,2))","v":""}]
[null,null,null,"Board Number/\n No. du conseil",null,{"$f":"IF($F$12=\"\",\"\",VLOOKUP($F$12,Facility!$A$92:$D$156,3))","v":""}]
[null,null,null,null,null,{"$f":"IF($F$12=\"\",\"\",VLOOKUP($F$12,Facility!$A$92:$D$156,4))","v":""}]
[]
[]
[]
[]
[null,null,null,"If your board is not listed please go to the \"Language\" worksheet to select a language."]
[null,null,null,"Si votre no. du conseil n'apparaît pas, sélectionner la langue sur la feuille de travail \"Language\"."]

{"sheet":"Form1","index":3,"n_rows":131,"n_cols":17,"rows_kept":131,"cut":false,"hidden":false,"merged":[[115,1,115,9],[96,16,96,17],[128,2,128,4],[107,6,109,6],[81,4,82,4],[97,6,99,6],[55,8,55,9],[46,7,46,9],[7,2,7,3],[11,2,11,3],[17,2,17,3],[40,2,40,3],[38,2,38,5],[39,2,39,5],[9,2,9,3],[36,2,36,3],[37,2,37,3],[23,2,23,3],[25,2,25,3]]}
["Applications for Educational Programs: Education and Community Partnership Program",null,null,null,null,null,null,null,null,null,null,"Filters"]
["(Grants for Student Needs Regulation)"]
[null,null,null,"Year","2021-22",{"$f":"IF(Lang=\"English\",\"DO NOT RENAME THE FORM\",\"NE CHANGEZ PAS LE NOM DU FORMULAIRE\")","v":"DO NOT RENAME THE FORM"},null,"Page 1",null,null,null,null,"Form Name"]
[null,null,null,"Application Form Number",1,{"$f":"IF(Lang=\"English\",\"PLEASE RE-ENTER ORIGINAL FORM NAME AS \"&N4,\"VEUILLEZ RÉINSCRIRE LE NOM DU FORMULAIRE D’ORIGINE COMME \"&N4)","v":"PLEASE RE-ENTER ORIGINAL FORM NAME AS Form1"},null,null,null,null,null,null,{"$f":"MID(CELL(\"Filename\",A1),SEARCH(\"]\",CELL(\"Filename\",A1),1)+1,32)","v":"Form1"},{"$f":"\"Form\"&E4","v":"Form1"}]
[null,"1. Board Information"]
[]
[{"$f":"IF(L7<>0,\"*\",\">\")","v":"*"},"DSB\n(Select from list)",null,null,null,null,null,null,null,null,null,{"$f":"IF(ISBLANK(C7),1,0)","v":1},"DSB No."]
[null,"Name of DSB"]
[null,"Superintendent"]
[null,"E-mail Address",null,null,null,"Ext:"]
[null,"Board Contact",null,"Telephone"]
[null,"Partner DSBs Name"]
[]
[null,"2. Agency"]
[]
[null,"Operated By ",null,null,null,"Ext:"]
[null,"Name",null,"Telephone"]
[null,"Address",null,null,"Address 2"]
[null,"Postal Code"]
[null,"Funding Ministry\n(Select from list)",null,"Identify additional ministry, if applicable"]
[]
[null,"3. Facility"]
[]
[null,"Name"]
[{"$f":"IF(L25<>0,\"*\",\">\")","v":"*"},"BSID",null,"(Note: # must begin with 64)",null,null,null,null,null,null,null,{"$f":"IF(ISBLANK(C25),1,0)","v":1},"BSID"]
[null,"Address",null,null,"Address 2"]
[null,"Postal Code",null,null,null,"Ext:"]
[null,"Contact Name",null,"Telephone"]
[null,"# Agency Staff on Site"]
[null,"# Agency Staff in Classroom"]
[null,"# of Day Treatment Spaces"]
[null,"# of Residential Beds/\nOperational Bed Capacity"]
[null,"# of Hospital Beds"]
[]
[null,"4. Type of Application & Facility",null,null,null,null,null,null,null,null,null,"Indicator Column"]
[]
[{"$f":"IF(L37<>0,\"*\",\">\")","v":"*"},"Application Type",null,null,null,null,null,null,null,null,null,{"$f":"IF(ISBLANK(C37),1,0)","v":1},"App Type"]
[{"$f":"IF(L38<>0,\"*\",\">\")","v":"*"},"Facility Type",null,null,null,null,null,null,null,null,null,{"$f":"IF(ISBLANK(C38),1,0)","v":1},"Facility Type"]
[null,"Care and/or Treatment Focus of the Facility",null,null,null,null,null,null,null,null,null,null,null,{"$f":"IF(C39=\"\",\"\",IF(AND(Lang=\"English\",C39<>\"\"),VLOOKUP(C39,Facility!A167:B171,2),VLOOKUP(C39,Facility!D166:E170,2)))","v":""},"Setting Lookup"]
[null,"Setting",null,null,null,null,null,null,null,null,null,{"$f":"IF(ISBLANK(F37),1,0)","v":1},"Program Change "]
[null,"Program Description for New Programs"]
[]
[]
[null,"5. Education Programs Enrolment: FTE",null,null,null,null,null,"Page 2"]
[]
[null,null,"Actual\n2020-21","Projected\n2021-22","Actual\n2021-22","(Application for Liaison/Administration has no enrolment data)",null,"5. a) Program Type and Primary Need/Cluster  / Type de programme et besoin primaire/groupement"]
[{"$f":"IF(OR(C65=\"juillet-août\",C65=\"July-August\"),\"\",IF(L78<>0,\"*\",\">\"))","v":">"},"September",null,null,null,null,null,"* Note: Refer to Instructions for ECPP Application Form 2021-22 for a breakdown of working definitions of Program Types and Primary Need/Cluster  /   * Remarque : Référez-vous aux Instructions relatives au formulaire de demande du PPEEC 2021-22 pour obtenir les détails des définitions de travail des types de programme et du besoin primaire/groupement"]
[null,"October",null,null,null,null,null,"Program Type / Type de programme"]
[null,"November",null,null,null,null,null,"Program Sub-Type / Sous-type de programme"]
[null,"December",null,null,null,null,null,"Primary Need/Cluster / Besoin primaire/groupement"]
[null,"January"]
[null,"February"]
[null,"March",null,null,null,null,null,"5. b) Admissions & Transitions  /  Admissions et transitions"]
[null,"April",null,null,null,null,null,null,"Referral Source 1/ Source de références 1","Referral Source 2/ Source de références 2"]
[null,"May ",null,null,null,null,null,"Referral Sources (select all that apply) / Sources de références (sélectionnez toutes celles qui s’appliquent)"]
[null,"June",null,null,null,null,null,"If \"Other\" was selected, please provide further information. / Si vous avez sélectionné « Autre », veuillez nous fournir davantage de renseignements."]
[{"$f":"IF(AND(OR(C65=\"July-August\",C65=\"juillet-août\"),L78<>0),\"*\",\"\")","v":""},"July"]
[null,"August"]
[]
[null,"Total Number of Students Served Last Year",null,null,null,null,null,"Is there a wait list? / Est-ce qu’il y a une liste d’attente d’élèves?"]
[null,null,null,null,null,null,null,"# of Children/Youth on Wait List / Nombre d’enfants/jeunes sur la liste d’attente"]
[null,"6. Panel"]
[]
[null,"Division Type"]
[{"$f":"IF(L65<>0,\"*\",\">\")","v":"*"},"Duration",null,null,null,null,null,null,null,null,null,{"$f":"IF(C65=0,1,0)","v":1},"Duration",{"$f":"IF(OR(C65=\"September-June\",C65=\"septembre-juin\"),1,IF(OR(C65=\"July-August\",C65=\"juillet-août\"),2,0))","v":0},"Duration Status (1: Reg Sch Yr, 2: Summer, 0: Null)"]
[null,"Language of Instruction"]
[null,"# of Classrooms in DSB Schools",null,"BSID"]
[null,"# of Classrooms not in DSB Schools"]
[null,"Location",null,"Location"]
[null,"From Grade"]
[null,"To Grade"]
[null,"Hours of Instruction"]
[null,"Program Attendance Expectations",null,{"$f":"IF(OR(C73=\"Combination of the above\",C73=\"Other\"),\"Please Specify: \",IF(OR(C73=\"FR - Combination of the above\",C73=\"Autre\"), \"Veuillez préciser :\",\"\"))","v":""},null,null,null,null,null,null,null,null,"PAE"]
[null,null,{"$f":"IF(OR(C73=\"Classroom Instruction\",C73=\"Classroom Instruction - FR\"), \"(Daily Attendance Required)\", IF(OR(C73=\"Independent Studies\",C73=\"Independent Studies - FR\"), \"(Daily Attendance Not Required)\",\"\"))","v":""},null,null,null,null,null,""]
[null,"7. Statistical Information"]
[]
[null,null,"Actual\n2020-21","Projected\n2021-22","Actual\n2021-22"]
[null,"Total FTE",{"$f":"SUM(C47:C58)","v":0},{"$f":"SUM(D47:D58)","v":0},{"$f":"SUM(E47:E58)","v":0},null,null,null,null,null,null,null,"FTE"]
[null,"Average Monthly FTE",{"$f":"IF(C78=0,0,+C78/COUNTIF(C47:C58,\">0\"))","v":0},{"$f":"IF(D78=0,0,+D78/COUNTIF(D47:D58,\">0\"))","v":0},{"$f":"IF(E78=0,0,+E78/COUNTIF(E47:E58,\">0\"))","v":0}]
[null,"PTR",{"$f":"IF(C78=0,0,IF(AND(C95=0,C96=0),0,+C79/(C95+0.5*C96)))","v":0},{"$f":"IF(D78=0,0,IF(AND(E95=0,E96=0),0,+D79/(E95+0.5*E96)))","v":0},{"$f":"IF(E78=0,0,IF(AND(E105=0,E106=0),0,+E79/(E105+0.5*E106)))","v":0}]
[]
[{"$f":"IF(L82<>0,\"*\",\">\")","v":"*"},"PTR (According to agreement)",null,":1",null,null,null,null,null,null,null,{"$f":"IF(ISBLANK(C82),1,0)","v":1},"PTR",null,{"$f":"Lang","v":"English"},"Lang",{"$f":"IF(O82=\"English\",\"Please Provide a Rationale for a PTR less than 8:\",\"FR - Please Provide a Rationale for a PTR less than 8 :\")","v":"Please Provide a Rationale for a PTR less than 8:"}]
[]
[]
[]
[]
[]
[]
[null,null,null,null,null,null,null,"Page 3"]
[null,"8. Request for Approval"]
[null,null,null,null,"CHECK NOTIFICATION BOX IN SECTION 9",null,"MINISTRY REGIONAL OFFICE ONLY",null,null,null,null,{"$f":"IF(C37=\"Liaison/Administration\",0,SUM(L7,L25,L37,L38,L65,L73,L78,L82))","v":6},"Total Indicators",null,0,"Block Status"]
[null,null,"Previous Year",null,"Projections",null,"Projection Approval"]
[null,"Salaries and Benefits","October\n2020-21",null,"Projected\n2021-22","Projected \n2021-22","March Approval \n2021-22","March Approval\n2021-22"]
[null,null,"#","$","#","$","#","$"]
[null,"Teachers",null,null,{"$f":"C95","v":0}]
[null,"Educational Assistants",null,null,{"$f":"C96","v":0}]
[null,"Other Salaries (EET)",null,null,0,{"$f":"IF(OR(Program_Change=\"non\", Program_Change=\"no\"),D97+(D97*1%),D97)","v":0},null,null,null,null,null,null,null,"Duration","Teacher","EA"]
[null,"Program Amount",null,{"$f":"IF(AND(ISBLANK(C95),ISBLANK(C96)),\"\",(O98*C95)+(P98*C96))","v":""},null,{"$f":"IF(AND(ISBLANK(E95),ISBLANK(E96)),\"\",(O98*E95)+(P98*E96))","v":0},null,{"$f":"IF(AND(ISBLANK(G95),ISBLANK(G96)),\"\",(O98*G95)+(P98*G96))","v":""},null,null,null,null,null,{"$f":"IF(N65=1,\"Reg Sch Year\",IF(N65=2,\"Summer\",\"Error\"))","v":"Error"},{"$f":"IF($N98=\"Reg Sch Year\",2666,IF($N98=\"Summer\",266*$Q$98,0))","v":0},{"$f":"IF($N98=\"Reg Sch Year\",1302,IF($N98=\"Summer\",130*$Q$98,0))","v":0},{"$f":"COUNT(D57:D58)","v":0}]
[null,"Furniture and Equipment"]
[null,"TOTAL",null,{"$f":"SUM(D95:D99)","v":0},null,{"$f":"SUM(F95:F99)","v":0},null,{"$f":"SUM(H95:H99)","v":0},null,null,null,null,null,"Note:","Summer School Program amounts are prorated by the number of months a program is in place over the summer"]
[]
[null,null,"Previous Year",null,"Actuals",null,"Actual Approvals"]
[null,"Salaries and Benefits","Actual\n2020-21",null,"Actual\n2021-22",null,"October Approval\n2021-22","October Approvals \n2021-22"]
[null,null,"#","$","#","$","#","$"]
[null,"Teachers"]
[null,"Educational Assistants"]
[null,"Other Salaries (EET)"]
[null,"Program Amount",null,{"$f":"IF(AND(ISBLANK(C105),ISBLANK(C106)),\"\",(O98*C105)+(P98*C106))","v":""},null,{"$f":"IF(AND(ISBLANK(E105),ISBLANK(E106)),\"\",(O98*E105)+(P98*E106))","v":""},null,{"$f":"IF(AND(ISBLANK(G105),ISBLANK(G106)),\"\",(O98*G105)+(P98*G106))","v":""}]
[null,"Furniture and Equipment"]
[null,"TOTAL",null,{"$f":"SUM(D105:D109)","v":0},null,{"$f":"SUM(F105:F109)","v":0},null,{"$f":"SUM(H105:H109)","v":0}]
[]
[]
[null,"9. Notifications"]
[]
[null,{"$f":"IF(Lang=\"English\",IF(C37=\"Liaison/Administration\",\"\",IF(OR(ISBLANK(C82),D78=0,C37=\"\",C38=\"\",C7=\"\",C25=\"\",C65=\"\",C73=\"\"),\"The Following Critical Fields are Missing:\",\"\")),IF(C37=\"Liaison/Administration\",\"\",IF(OR(ISBLANK(C82),D78=0,C37=\"\",C38=\"\",C7=\"\",C25=\"\",C65=\"\",C73=\"\"),\"Les champs essentiels suivants sont incomplets:\",\"\")))","v":"The Following Critical Fields are Missing:"}]
[null,{"$f":"IF(Lang=\"English\",IF(C37=\"Liaison/Administration\",\"\",IF(OR(ISBLANK(C82),D78=0,C37=\"\",C38=\"\",C7=\"\",C25=\"\",C65=\"\",C73=\"\"),\" \"&IF(ISBLANK(C82),\"* PTR \",\"\")&IF(D78=0,\"* FTE \",\"\")&IF(C37=\"\",\"* Application Type \",\"\")&IF(C38=0,\"* Facility Type \",\"\")&IF(C7=0,\"* DSB \",\"\")&IF(C25=0,\"* BSID \",\"\")&IF(C65=0,\"* Duration \",\"\")&IF(C73=0,\"* Program Attendance Expectations\",\"\")&\" >>> Please enter all missing data.\")),IF(C37=\"Liaison/Administration\",\"\",IF(OR(ISBLANK(C82),D78=0,C37=\"\",C38=\"\",C7=\"\",C25=\"\",C65=\"\",C73=\"\"),\" \"&IF(ISBLANK(C82),\"* REE \",\"\")&IF(D78=0,\"* ETP \",\"\")&IF(C37=\"\",\"* Type de demande \",\"\")&IF(C38=0,\"* Type d'établissement \",\"\")&IF(C7=0,\"* CSD \",\"\")&IF(C25=0,\"* NIM \",\"\")&IF(C65=0,\"* Durée \",\"\")&IF(C73=0,\"* Attentes à l’égard de la fréquentation du programme\",\"\")&\" >>> Veuillez entrer les données incomplètes ou erronées.\")))","v":" * PTR * FTE * Application Type * Facility Type * DSB * BSID * Duration * Program Attendance Expectations >>> Please enter all missing data."}]
[null,{"$f":"IF(C105=0,\"\",IF(ABS(((F95/E95)-(D105/C105))/(D105/C105))>=0.3,\"Warning - Average teacher salaries & benefits changes more than 30% compared to last year / Avis -Le salaire et les avantages sociaux de l'enseignante ou de l'enseignant ont augmenté de plus de 30% depuis l'an passé\",\"\"))","v":""}]
[]
[null,"FOR OFFICE USE ONLY"]
[]
[null,"Approval and Signoff"]
[]
[null,"Status",null,{"$f":"IF(C123=\"\",\"\",IF(AND(Lang=\"English\",C123<>\"\"),VLOOKUP(C123,Facility!I18:J22,2),VLOOKUP(C123,Facility!K18:L22,2)))","v":""}]
[null,"Monitoring Year"]
[null,"Reviewed by Education Officer"]
[null,"Regional Office"]
[null,"Date"]
[]
[null,"Education Officer Notes"]
[]
[null,"Note: Agreements must be forwarded to the Regional Office. Information received is subject to review or audit."]

{"sheet":"Datasheet","index":4,"n_rows":73,"n_cols":178,"rows_kept":73,"cut":false,"hidden":true,"merged":[]}
["Summary of Section 23 Claims - 2018-2019:"]
["Sommaire des demandes pour les programmes des Articles 23 - 2018-2019"]
[]
["999999=+Form1!C7"]
["999999=+Form1!C8"]
["999999=IF(Summary!H5=\"Signature:\",\"Divested\",\"Non-Divested\")",null,null,null,null,null,null,null,null,null,null,null,null,null,null,null,null,null,null,null,null,null,null,null,null,null,null,null,null,null,null,null,null,null,null,null,null,null,null,null,null,null,null,null,null,null,null,null,null,null,null,null,null,null,null,null,null,null,null,null,null,null,null,null,null,null,null,null,null,null,null,null,null,null,null,null,null,null,null,null,null,null,null,null,null,null,null,null,null,null,null,null,null,null,null,null,null,null,null,null,null,null,null,null,null,null,null,null,null,null,null,null,null,null,null,null,null,null,null,null,null,null,null,null,null,null,null,null,null,null,null,null,null,"june_app_1213_amt_total"]
[]
[]
[]
[]
["Index","filename","s23year","RO","boardno","Form #","DSBNo","dsbno2","Name of DSB","Superintendent","E-mail Address","Board Contact","Telephone","Ext.","Partner DSBs Name","Agency Operated By ","Agency Name","Agency Telephone","Agency Ext","Agency Address","Agency Address 2","Postal Code","Funding Ministry\n(Select from list)","Multiple Ministries","Facility Name","Facility BSID","Facility Address","Facility Address 2","Facility Postal Code","Facility Contact Name","Facility Telephone","Facility Ext.","# Agency Staff on Site","# Agency Staff in Classroom","# of Day Treatment Spaces","# of Residential Beds/\nOperational Bed Capacity","# of Hospital Beds","Application Type","app_type1","Facility Type","facility_type1","Care and/or Treatment Focus of the Facility","care_treat_focus1","Setting","ct_setting1","Program Description Status","SepAct1718FTE","OctAct1718FTE","NovAct1718FTE","DecAct1718FTE","JanAct1718FTE","FebAct1718FTE","MarAct1718FTE","AprAct1718FTE","May Act1718FTE","JunAct1718FTE","JulAct1718FTE","AugAct1718FTE","SepProj1819FTE","OctProj1819FTE","NovProj1819FTE","DecProj1819FTE","JanProj1819FTE","FebProj1819FTE","MarProj1819FTE","AprProj1819FTE","May Proj1819FTE","JunProj1819FTE","JulProj1819FTE","AugProj1819FTE","SepAct1819FTE","OctAct1819FTE","NovAct1819FTE","DecAct1819FTE","JanAct1819FTE","FebAct1819FTE","MarAct1819FTE","AprAct1819FTE","May Act1819FTE","JunAct1819FTE","JulAct1819FTE","AugAct1819FTE","Total Number of Students Served in 2015-16","Division Type","Duration","duration1","Language of Instruction","# of Classrooms in DSB Schools","OtherBSID","# of Classrooms not in DSB Schools","Location","LocationSpecify","From Grade","To Grade","Hours of Instruction","Program Attendance Expectations","PAESpecify","Act1718TotFTE","Act1718AvgMthFTE","Act1718PTR","Proj1819TotFTE","Proj1819AvgMthFTE","Proj1819PTR","Act1819TotFTE","Act1819AvgMthFTE","Act1819PTR","PTR_agrmt","oct_app_1718_num_teach","oct_app_1718_amt_teach","oct_app_1718_num_ea","oct_app_1718_amt_ea","oct_app_1718_num_eet_os","oct_app_1718_amt_eet_os","oct_app_1718_amt_pa_ben","oct_app_1718_amt_fe_do","DIV_oct_app_1718_amt_cap","oct_app_1718_amt_tot","mar_proj_1819_num_teach","mar_proj_1819_amt_teach","mar_proj_1819_num_ea","mar_proj_1819_amt_ea","mar_proj_1819_num_eet_os","mar_proj_1819_amt_eet_os","mar_proj_1819_amt_pa_ben","mar_proj_1819_amt_fe_do","DIV_mar_proj_1819_amt_cap","mar_proj_1819_amt_tot","mar_app_1819_num_teach","mar_app_1819_amt_teach","mar_app_1819_num_ea","mar_app_1819_amt_ea","mar_app_1819_num_eet_os","mar_app_1819_amt_eet_os","mar_app_1819_amt_pa_ben","mar_app_1819_amt_fe_do","DIV_mar_app_1819_amt_cap","mar_app_1819_amt_tot","oct_act_1718_numteach","oct_act_1718_amtteach","oct_act_1718_num_ea","oct_act_1718_amt_ea","oct_act_1718_num_eet_os","oct_act_1718_amt_eet_os","oct_act_1718_amt_pa_ben","oct_act_1718_amt_fe_do","DIV_oct_act_1718_amt_cap","oct_act_1718_amt_tot","oct_act_1819_num_teach","oct_act_1819_amt_teach","oct_act_1819_num_ea","oct_act_1819_amt_ea","oct_act_1819_num_eet_os","oct_act_1819_amt_eet_os","oct_act_1819_amt_pa_ben","oct_act_1819_amt_fe_do","DIV_oct_act_1819_amt_cap","oct_act_1819_amt_tot","oct_app_1819_num_teach","oct_app_1819_amt_teach","oct_app_1819_num_ea","oct_app_1819_amt_ea","oct_app_1819_num_eet_os","oct_app_1819_amt_eet_os","oct_app_1819_amt_pa_ben","oct_app_1819_amt_fe_do","DIV_oct_app_1819_amt_cap","oct_app_1819_amt_tot","oct_app_1819_numfundteach","oct_app_1819_numfundea","Status","status1","StatusID","Monitoring Year","Reviewed by Education Officer","Regional Office","Date","EONotes","reg-div"]
[1,"999999=+MID(CELL(\"filename\",A1),FIND(\"[\",CELL(\"filename\",A1))+1,FIND(\"]\", CELL(\"filename\",A1))-FIND(\"[\",CELL(\"filename\",A1))-1)",null,null,"999999=+Form1!E5",1,"999999=+Form1!C7",null,"999999=+Form1!C8","999999=+Form1!C9","999999=+Form1!C10","999999=+Form1!C11","999999=+Form1!E11","999999=+Form1!F11","999999=+Form1!C12","999999=+Form1!C16","999999=+Form1!C17","999999=+Form1!E17","999999=+Form1!F17","999999=+Form1!C18","999999=+Form1!F18","999999=+Form1!C19","999999=+Form1!C20","999999=+Form1!E20","999999=+Form1!C24","999999=+Form1!C25","999999=+Form1!C26","999999=+Form1!F26","999999=+Form1!C27","999999=+Form1!C28","999999=+Form1!E28","999999=+Form1!F28","999999=+Form1!C29","999999=+Form1!C30","999999=+Form1!C31","999999=+Form1!C32","999999=+Form1!C33","999999=+Form1!C37",null,"999999=+Form1!C38",null,"999999=+Form1!C39",null,"999999=+Form1!C40",null,"999999=+Form1!C41","999999=+Form1!C47","999999=+Form1!C48","999999=+Form1!C49","999999=+Form1!C50","999999=+Form1!C51","999999=+Form1!C52","999999=+Form1!C53","999999=+Form1!C54","999999=+Form1!C55","999999=+Form1!C56","999999=+Form1!C57","999999=+Form1!C58","999999=+Form1!D47","999999=+Form1!D48","999999=+Form1!D49","999999=+Form1!D50","999999=+Form1!D51","999999=+Form1!D52","999999=+Form1!D53","999999=+Form1!D54","999999=+Form1!D55","999999=+Form1!D56","999999=+Form1!D57","999999=+Form1!D58","999999=+Form1!E47","999999=+Form1!E48","999999=+Form1!E49","999999=+Form1!E50","999999=+Form1!E51","999999=+Form1!E52","999999=+Form1!E53","999999=+Form1!E54","999999=+Form1!E55","999999=+Form1!E56","999999=+Form1!E57","999999=+Form1!E58","999999=+Form1!$C$60","999999=+Form1!C64","999999=+Form1!C65",null,"999999=+Form1!C66","999999=+Form1!C67","999999=+Form1!$E$67","999999=+Form1!C68","999999=+Form1!C69","999999=+Form1!E69","999999=+Form1!C70","999999=+Form1!C71","999999=+Form1!C72","999999=+Form1!C73","999999=+Form1!E73","999999=+Form1!C78","999999=+Form1!C79","999999=+Form1!C80","999999=+Form1!D78","999999=+Form1!D79","999999=+Form1!D80","999999=+Form1!E78","999999=+Form1!E79","999999=+Form1!E80","999999=+Form1!C82","999999=+Form1!C95","999999=+Form1!D95","999999=+Form1!C96","999999=+Form1!D96","999999=+Form1!C97","999999=+Form1!D97","999999=+Form1!D98","999999=+Form1!D99",0,"999999=+Form1!D100","999999=+Form1!E95","999999=+Form1!F95","999999=+Form1!E96","999999=+Form1!F96","999999=+Form1!E97","999999=+Form1!F97","999999=+Form1!F98","999999=+Form1!F99",0,"999999=+Form1!F100","999999=+Form1!G95","999999=+Form1!H95","999999=+Form1!G96","999999=+Form1!H96","999999=+Form1!G97","999999=+Form1!H97","999999=+Form1!H98","999999=+Form1!H99",0,"999999=+Form1!H100","999999=+Form1!C105","999999=+Form1!D105","999999=+Form1!C106","999999=+Form1!D106","999999=+Form1!C107","999999=+Form1!D107","999999=+Form1!D108","999999=+Form1!D109",0,"999999=+Form1!D110","999999=+Form1!E105","999999=+Form1!F105","999999=+Form1!E106","999999=+Form1!F106","999999=+Form1!E107","999999=+Form1!F107","999999=+Form1!F108","999999=+Form1!F109",0,"999999=+Form1!F110","999999=+Form1!G105","999999=+Form1!H105","999999=+Form1!G106","999999=+Form1!H106","999999=+Form1!G107","999999=+Form1!H107","999999=+Form1!H108","999999=+Form1!H109",0,"999999=+Form1!H110","999999=+Form1!J105","999999=+Form1!J106","999999=+Form1!C123",null,"999999=+Form1!D123","999999=+Form1!C124","999999=+Form1!C125","999999=+Form1!C126","999999=+Form1!C127","999999=+Form1!C129","Non-Divested"]
[2,"999999=+MID(CELL(\"filename\",A1),FIND(\"[\",CELL(\"filename\",A1))+1,FIND(\"]\", CELL(\"filename\",A1))-FIND(\"[\",CELL(\"filename\",A1))-1)",null,null,"999999=+Form2!E5",2,"999999=+Form2!C7",null,"999999=+Form2!C8","999999=+Form2!C9","999999=+Form2!C10","999999=+Form2!C11","999999=+Form2!E11","999999=+Form2!F11","999999=+Form2!C12","999999=+Form2!C16","999999=+Form2!C17","999999=+Form2!E17","999999=+Form2!F17","999999=+Form2!C18","999999=+Form2!F18","999999=+Form2!C19","999999=+Form2!C20","999999=+Form2!E20","999999=+Form2!C24","999999=+Form2!C25","999999=+Form2!C26","999999=+Form2!F26","999999=+Form2!C27","999999=+Form2!C28","999999=+Form2!E28","999999=+Form2!F28","999999=+Form2!C29","999999=+Form2!C30","999999=+Form2!C31","999999=+Form2!C32","999999=+Form2!C33","999999=+Form2!C37",null,"999999=+Form2!C38",null,"999999=+Form2!C39",null,"999999=+Form2!C40",null,"999999=+Form2!C41","999999=+Form2!C47","999999=+Form2!C48","999999=+Form2!C49","999999=+Form2!C50","999999=+Form2!C51","999999=+Form2!C52","999999=+Form2!C53","999999=+Form2!C54","999999=+Form2!C55","999999=+Form2!C56","999999=+Form2!C57","999999=+Form2!C58","999999=+Form2!D47","999999=+Form2!D48","999999=+Form2!D49","999999=+Form2!D50","999999=+Form2!D51","999999=+Form2!D52","999999=+Form2!D53","999999=+Form2!D54","999999=+Form2!D55","999999=+Form2!D56","999999=+Form2!D57","999999=+Form2!D58","999999=+Form2!E47","999999=+Form2!E48","999999=+Form2!E49","999999=+Form2!E50","999999=+Form2!E51","999999=+Form2!E52","999999=+Form2!E53","999999=+Form2!E54","999999=+Form2!E55","999999=+Form2!E56","999999=+Form2!E57","999999=+Form2!E58","999999=+Form2!$C$60","999999=+Form2!C64","999999=+Form2!C65",null,"999999=+Form2!C66","999999=+Form2!C67","999999=+Form2!$E$67","999999=+Form2!C68","999999=+Form2!C69","999999=+Form2!E69","999999=+Form2!C70","999999=+Form2!C71","999999=+Form2!C72","999999=+Form2!C73","999999=+Form2!E73","999999=+Form2!C78","999999=+Form2!C79","999999=+Form2!C80","999999=+Form2!D78","999999=+Form2!D79","999999=+Form2!D80","999999=+Form2!E78","999999=+Form2!E79","999999=+Form2!E80","999999=+Form2!C82","999999=+Form2!C95","999999=+Form2!D95","999999=+Form2!C96","999999=+Form2!D96","999999=+Form2!C97","999999=+Form2!D97","999999=+Form2!D98","999999=+Form2!D99",0,"999999=+Form2!D100","999999=+Form2!E95","999999=+Form2!F95","999999=+Form2!E96","999999=+Form2!F96","999999=+Form2!E97","999999=+Form2!F97","999999=+Form2!F98","999999=+Form2!F99",0,"999999=+Form2!F100","999999=+Form2!G95","999999=+Form2!H95","999999=+Form2!G96","999999=+Form2!H96","999999=+Form2!G97","999999=+Form2!H97","999999=+Form2!H98","999999=+Form2!H99",0,"999999=+Form2!H100","999999=+Form2!C105","999999=+Form2!D105","999999=+Form2!C106","999999=+Form2!D106","999999=+Form2!C107","999999=+Form2!D107","999999=+Form2!D108","999999=+Form2!D109",0,"999999=+Form2!D110","999999=+Form2!E105","999999=+Form2!F105","999999=+Form2!E106","999999=+Form2!F106","999999=+Form2!E107","999999=+Form2!F107","999999=+Form2!F108","999999=+Form2!F109",0,"999999=+Form2!F110","999999=+Form2!G105","999999=+Form2!H105","999999=+Form2!G106","999999=+Form2!H106","999999=+Form2!G107","999999=+Form2!H107","999999=+Form2!H108","999999=+Form2!H109",0,"999999=+Form2!H110","999999=+Form2!J105","999999=+Form2!J106","999999=+Form2!C123",null,"999999=+Form2!D123","999999=+Form2!C124","999999=+Form2!C125","999999=+Form2!C126","999999=+Form2!C127","999999=+Form2!C129","Non-Divested"]
[3,"999999=+MID(CELL(\"filename\",A1),FIND(\"[\",CELL(\"filename\",A1))+1,FIND(\"]\", CELL(\"filename\",A1))-FIND(\"[\",CELL(\"filename\",A1))-1)",null,null,"999999=+Form3!E5",3,"999999=+Form3!C7",null,"999999=+Form3!C8","999999=+Form3!C9","999999=+Form3!C10","999999=+Form3!C11","999999=+Form3!E11","999999=+Form3!F11","999999=+Form3!C12","999999=+Form3!C16","999999=+Form3!C17","999999=+Form3!E17","999999=+Form3!F17","999999=+Form3!C18","999999=+Form3!F18","999999=+Form3!C19","999999=+Form3!C20","999999=+Form3!E20","999999=+Form3!C24","999999=+Form3!C25","999999=+Form3!C26","999999=+Form3!F26","999999=+Form3!C27","999999=+Form3!C28","999999=+Form3!E28","999999=+Form3!F28","999999=+Form3!C29","999999=+Form3!C30","999999=+Form3!C31","999999=+Form3!C32","999999=+Form3!C33","999999=+Form3!C37",null,"999999=+Form3!C38",null,"999999=+Form3!C39",null,"999999=+Form3!C40",null,"999999=+Form3!C41","999999=+Form3!C47","999999=+Form3!C48","999999=+Form3!C49","999999=+Form3!C50","999999=+Form3!C51","999999=+Form3!C52","999999=+Form3!C53","999999=+Form3!C54","999999=+Form3!C55","999999=+Form3!C56","999999=+Form3!C57","999999=+Form3!C58","999999=+Form3!D47","999999=+Form3!D48","999999=+Form3!D49","999999=+Form3!D50","999999=+Form3!D51","999999=+Form3!D52","999999=+Form3!D53","999999=+Form3!D54","999999=+Form3!D55","999999=+Form3!D56","999999=+Form3!D57","999999=+Form3!D58","999999=+Form3!E47","999999=+Form3!E48","999999=+Form3!E49","999999=+Form3!E50","999999=+Form3!E51","999999=+Form3!E52","999999=+Form3!E53","999999=+Form3!E54","999999=+Form3!E55","999999=+Form3!E56","999999=+Form3!E57","999999=+Form3!E58","999999=+Form3!$C$60","999999=+Form3!C64","999999=+Form3!C65",null,"999999=+Form3!C66","999999=+Form3!C67","999999=+Form3!$E$67","999999=+Form3!C68","999999=+Form3!C69","999999=+Form3!E69","999999=+Form3!C70","999999=+Form3!C71","999999=+Form3!C72","999999=+Form3!C73","999999=+Form3!E73","999999=+Form3!C78","999999=+Form3!C79","999999=+Form3!C80","999999=+Form3!D78","999999=+Form3!D79","999999=+Form3!D80","999999=+Form3!E78","999999=+Form3!E79","999999=+Form3!E80","999999=+Form3!C82","999999=+Form3!C95","999999=+Form3!D95","999999=+Form3!C96","999999=+Form3!D96","999999=+Form3!C97","999999=+Form3!D97","999999=+Form3!D98","999999=+Form3!D99",0,"999999=+Form3!D100","999999=+Form3!E95","999999=+Form3!F95","999999=+Form3!E96","999999=+Form3!F96","999999=+Form3!E97","999999=+Form3!F97","999999=+Form3!F98","999999=+Form3!F99",0,"999999=+Form3!F100","999999=+Form3!G95","999999=+Form3!H95","999999=+Form3!G96","999999=+Form3!H96","999999=+Form3!G97","999999=+Form3!H97","999999=+Form3!H98","999999=+Form3!H99",0,"999999=+Form3!H100","999999=+Form3!C105","999999=+Form3!D105","999999=+Form3!C106","999999=+Form3!D106","999999=+Form3!C107","999999=+Form3!D107","999999=+Form3!D108","999999=+Form3!D109",0,"999999=+Form3!D110","999999=+Form3!E105","999999=+Form3!F105","999999=+Form3!E106","999999=+Form3!F106","999999=+Form3!E107","999999=+Form3!F107","999999=+Form3!F108","999999=+Form3!F109",0,"999999=+Form3!F110","999999=+Form3!G105","999999=+Form3!H105","999999=+Form3!G106","999999=+Form3!H106","999999=+Form3!G107","999999=+Form3!H107","999999=+Form3!H108","999999=+Form3!H109",0,"999999=+Form3!H110","999999=+Form3!J105","999999=+Form3!J106","999999=+Form3!C123",null,"999999=+Form3!D123","999999=+Form3!C124","999999=+Form3!C125","999999=+Form3!C126","999999=+Form3!C127","999999=+Form3!C129","Non-Divested"]
[4,"999999=+MID(CELL(\"filename\",A1),FIND(\"[\",CELL(\"filename\",A1))+1,FIND(\"]\", CELL(\"filename\",A1))-FIND(\"[\",CELL(\"filename\",A1))-1)",null,null,"999999=+Form4!E5",4,"999999=+Form4!C7",null,"999999=+Form4!C8","999999=+Form4!C9","999999=+Form4!C10","999999=+Form4!C11","999999=+Form4!E11","999999=+Form4!F11","999999=+Form4!C12","999999=+Form4!C16","999999=+Form4!C17","999999=+Form4!E17","999999=+Form4!F17","999999=+Form4!C18","999999=+Form4!F18","999999=+Form4!C19","999999=+Form4!C20","999999=+Form4!E20","999999=+Form4!C24","999999=+Form4!C25","999999=+Form4!C26","999999=+Form4!F26","999999=+Form4!C27","999999=+Form4!C28","999999=+Form4!E28","999999=+Form4!F28","999999=+Form4!C29","999999=+Form4!C30","999999=+Form4!C31","999999=+Form4!C32","999999=+Form4!C33","999999=+Form4!C37",null,"999999=+Form4!C38",null,"999999=+Form4!C39",null,"999999=+Form4!C40",null,"999999=+Form4!C41","999999=+Form4!C47","999999=+Form4!C48","999999=+Form4!C49","999999=+Form4!C50","999999=+Form4!C51","999999=+Form4!C52","999999=+Form4!C53","999999=+Form4!C54","999999=+Form4!C55","999999=+Form4!C56","999999=+Form4!C57","999999=+Form4!C58","999999=+Form4!D47","999999=+Form4!D48","999999=+Form4!D49","999999=+Form4!D50","999999=+Form4!D51","999999=+Form4!D52","999999=+Form4!D53","999999=+Form4!D54","999999=+Form4!D55","999999=+Form4!D56","999999=+Form4!D57","999999=+Form4!D58","999999=+Form4!E47","999999=+Form4!E48","999999=+Form4!E49","999999=+Form4!E50","999999=+Form4!E51","999999=+Form4!E52","999999=+Form4!E53","999999=+Form4!E54","999999=+Form4!E55","999999=+Form4!E56","999999=+Form4!E57","999999=+Form4!E58","999999=+Form4!$C$60","999999=+Form4!C64","999999=+Form4!C65",null,"999999=+Form4!C66","999999=+Form4!C67","999999=+Form4!$E$67","999999=+Form4!C68","999999=+Form4!C69","999999=+Form4!E69","999999=+Form4!C70","999999=+Form4!C71","999999=+Form4!C72","999999=+Form4!C73","999999=+Form4!E73","999999=+Form4!C78","999999=+Form4!C79","999999=+Form4!C80","999999=+Form4!D78","999999=+Form4!D79","999999=+Form4!D80","999999=+Form4!E78","999999=+Form4!E79","999999=+Form4!E80","999999=+Form4!C82","999999=+Form4!C95","999999=+Form4!D95","999999=+Form4!C96","999999=+Form4!D96","999999=+Form4!C97","999999=+Form4!D97","999999=+Form4!D98","999999=+Form4!D99",0,"999999=+Form4!D100","999999=+Form4!E95","999999=+Form4!F95","999999=+Form4!E96","999999=+Form4!F96","999999=+Form4!E97","999999=+Form4!F97","999999=+Form4!F98","999999=+Form4!F99",0,"999999=+Form4!F100","999999=+Form4!G95","999999=+Form4!H95","999999=+Form4!G96","999999=+Form4!H96","999999=+Form4!G97","999999=+Form4!H97","999999=+Form4!H98","999999=+Form4!H99",0,"999999=+Form4!H100","999999=+Form4!C105","999999=+Form4!D105","999999=+Form4!C106","999999=+Form4!D106","999999=+Form4!C107","999999=+Form4!D107","999999=+Form4!D108","999999=+Form4!D109",0,"999999=+Form4!D110","999999=+Form4!E105","999999=+Form4!F105","999999=+Form4!E106","999999=+Form4!F106","999999=+Form4!E107","999999=+Form4!F107","999999=+Form4!F108","999999=+Form4!F109",0,"999999=+Form4!F110","999999=+Form4!G105","999999=+Form4!H105","999999=+Form4!G106","999999=+Form4!H106","999999=+Form4!G107","999999=+Form4!H107","999999=+Form4!H108","999999=+Form4!H109",0,"999999=+Form4!H110","999999=+Form4!J105","999999=+Form4!J106","999999=+Form4!C123",null,"999999=+Form4!D123","999999=+Form4!C124","999999=+Form4!C125","999999=+Form4!C126","999999=+Form4!C127","999999=+Form4!C129","Non-Divested"]
[5,"999999=+MID(CELL(\"filename\",A1),FIND(\"[\",CELL(\"filename\",A1))+1,FIND(\"]\", CELL(\"filename\",A1))-FIND(\"[\",CELL(\"filename\",A1))-1)",null,null,"999999=+Form5!E5",5,"999999=+Form5!C7",null,"999999=+Form5!C8","999999=+Form5!C9","999999=+Form5!C10","999999=+Form5!C11","999999=+Form5!E11","999999=+Form5!F11","999999=+Form5!C12","999999=+Form5!C16","999999=+Form5!C17","999999=+Form5!E17","999999=+Form5!F17","999999=+Form5!C18","999999=+Form5!F18","999999=+Form5!C19","999999=+Form5!C20","999999=+Form5!E20","999999=+Form5!C24","999999=+Form5!C25","999999=+Form5!C26","999999=+Form5!F26","999999=+Form5!C27","999999=+Form5!C28","999999=+Form5!E28","999999=+Form5!F28","999999=+Form5!C29","999999=+Form5!C30","999999=+Form5!C31","999999=+Form5!C32","999999=+Form5!C33","999999=+Form5!C37",null,"999999=+Form5!C38",null,"999999=+Form5!C39",null,"999999=+Form5!C40",null,"999999=+Form5!C41","999999=+Form5!C47","999999=+Form5!C48","999999=+Form5!C49","999999=+Form5!C50","999999=+Form5!C51","999999=+Form5!C52","999999=+Form5!C53","999999=+Form5!C54","999999=+Form5!C55","999999=+Form5!C56","999999=+Form5!C57","999999=+Form5!C58","999999=+Form5!D47","999999=+Form5!D48","999999=+Form5!D49","999999=+Form5!D50","999999=+Form5!D51","999999=+Form5!D52","999999=+Form5!D53","999999=+Form5!D54","999999=+Form5!D55","999999=+Form5!D56","999999=+Form5!D57","999999=+Form5!D58","999999=+Form5!E47","999999=+Form5!E48","999999=+Form5!E49","999999=+Form5!E50","999999=+Form5!E51","999999=+Form5!E52","999999=+Form5!E53","999999=+Form5!E54","999999=+Form5!E55","999999=+Form5!E56","999999=+Form5!E57","999999=+Form5!E58","999999=+Form5!$C$60","999999=+Form5!C64","999999=+Form5!C65",null,"999999=+Form5!C66","999999=+Form5!C67","999999=+Form5!$E$67","999999=+Form5!C68","999999=+Form5!C69","999999=+Form5!E69","999999=+Form5!C70","999999=+Form5!C71","999999=+Form5!C72","999999=+Form5!C73","999999=+Form5!E73","999999=+Form5!C78","999999=+Form5!C79","999999=+Form5!C80","999999=+Form5!D78","999999=+Form5!D79","999999=+Form5!D80","999999=+Form5!E78","999999=+Form5!E79","999999=+Form5!E80","999999=+Form5!C82","999999=+Form5!C95","999999=+Form5!D95","999999=+Form5!C96","999999=+Form5!D96","999999=+Form5!C97","999999=+Form5!D97","999999=+Form5!D98","999999=+Form5!D99",0,"999999=+Form5!D100","999999=+Form5!E95","999999=+Form5!F95","999999=+Form5!E96","999999=+Form5!F96","999999=+Form5!E97","999999=+Form5!F97","999999=+Form5!F98","999999=+Form5!F99",0,"999999=+Form5!F100","999999=+Form5!G95","999999=+Form5!H95","999999=+Form5!G96","999999=+Form5!H96","999999=+Form5!G97","999999=+Form5!H97","999999=+Form5!H98","999999=+Form5!H99",0,"999999=+Form5!H100","999999=+Form5!C105","999999=+Form5!D105","999999=+Form5!C106","999999=+Form5!D106","999999=+Form5!C107","999999=+Form5!D107","999999=+Form5!D108","999999=+Form5!D109",0,"999999=+Form5!D110","999999=+Form5!E105","999999=+Form5!F105","999999=+Form5!E106","999999=+Form5!F106","999999=+Form5!E107","999999=+Form5!F107","999999=+Form5!F108","999999=+Form5!F109",0,"999999=+Form5!F110","999999=+Form5!G105","999999=+Form5!H105","999999=+Form5!G106","999999=+Form5!H106","999999=+Form5!G107","999999=+Form5!H107","999999=+Form5!H108","999999=+Form5!H109",0,"999999=+Form5!H110","999999=+Form5!J105","999999=+Form5!J106","999999=+Form5!C123",null,"999999=+Form5!D123","999999=+Form5!C124","999999=+Form5!C125","999999=+Form5!C126","999999=+Form5!C127","999999=+Form5!C129","Non-Divested"]
[6,"999999=+MID(CELL(\"filename\",A1),FIND(\"[\",CELL(\"filename\",A1))+1,FIND(\"]\", CELL(\"filename\",A1))-FIND(\"[\",CELL(\"filename\",A1))-1)",null,null,"999999=+Form6!E5",6,"999999=+Form6!C7",null,"999999=+Form6!C8","999999=+Form6!C9","999999=+Form6!C10","999999=+Form6!C11","999999=+Form6!E11","999999=+Form6!F11","999999=+Form6!C12","999999=+Form6!C16","999999=+Form6!C17","999999=+Form6!E17","999999=+Form6!F17","999999=+Form6!C18","999999=+Form6!F18","999999=+Form6!C19","999999=+Form6!C20","999999=+Form6!E20","999999=+Form6!C24","999999=+Form6!C25","999999=+Form6!C26","999999=+Form6!F26","999999=+Form6!C27","999999=+Form6!C28","999999=+Form6!E28","999999=+Form6!F28","999999=+Form6!C29","999999=+Form6!C30","999999=+Form6!C31","999999=+Form6!C32","999999=+Form6!C33","999999=+Form6!C37",null,"999999=+Form6!C38",null,"999999=+Form6!C39",null,"999999=+Form6!C40",null,"999999=+Form6!C41","999999=+Form6!C47","999999=+Form6!C48","999999=+Form6!C49","999999=+Form6!C50","999999=+Form6!C51","999999=+Form6!C52","999999=+Form6!C53","999999=+Form6!C54","999999=+Form6!C55","999999=+Form6!C56","999999=+Form6!C57","999999=+Form6!C58","999999=+Form6!D47","999999=+Form6!D48","999999=+Form6!D49","999999=+Form6!D50","999999=+Form6!D51","999999=+Form6!D52","999999=+Form6!D53","999999=+Form6!D54","999999=+Form6!D55","999999=+Form6!D56","999999=+Form6!D57","999999=+Form6!D58","999999=+Form6!E47","999999=+Form6!E48","999999=+Form6!E49","999999=+Form6!E50","999999=+Form6!E51","999999=+Form6!E52","999999=+Form6!E53","999999=+Form6!E54","999999=+Form6!E55","999999=+Form6!E56","999999=+Form6!E57","999999=+Form6!E58","999999=+Form6!$C$60","999999=+Form6!C64","999999=+Form6!C65",null,"999999=+Form6!C66","999999=+Form6!C67","999999=+Form6!$E$67","999999=+Form6!C68","999999=+Form6!C69","999999=+Form6!E69","999999=+Form6!C70","999999=+Form6!C71","999999=+Form6!C72","999999=+Form6!C73","999999=+Form6!E73","999999=+Form6!C78","999999=+Form6!C79","999999=+Form6!C80","999999=+Form6!D78","999999=+Form6!D79","999999=+Form6!D80","999999=+Form6!E78","999999=+Form6!E79","999999=+Form6!E80","999999=+Form6!C82","999999=+Form6!C95","999999=+Form6!D95","999999=+Form6!C96","999999=+Form6!D96","999999=+Form6!C97","999999=+Form6!D97","999999=+Form6!D98","999999=+Form6!D99",0,"999999=+Form6!D100","999999=+Form6!E95","999999=+Form6!F95","999999=+Form6!E96","999999=+Form6!F96","999999=+Form6!E97","999999=+Form6!F97","999999=+Form6!F98","999999=+Form6!F99",0,"999999=+Form6!F100","999999=+Form6!G95","999999=+Form6!H95","999999=+Form6!G96","999999=+Form6!H96","999999=+Form6!G97","999999=+Form6!H97","999999=+Form6!H98","999999=+Form6!H99",0,"999999=+Form6!H100","999999=+Form6!C105","999999=+Form6!D105","999999=+Form6!C106","999999=+Form6!D106","999999=+Form6!C107","999999=+Form6!D107","999999=+Form6!D108","999999=+Form6!D109",0,"999999=+Form6!D110","999999=+Form6!E105","999999=+Form6!F105","999999=+Form6!E106","999999=+Form6!F106","999999=+Form6!E107","999999=+Form6!F107","999999=+Form6!F108","999999=+Form6!F109",0,"999999=+Form6!F110","999999=+Form6!G105","999999=+Form6!H105","999999=+Form6!G106","999999=+Form6!H106","999999=+Form6!G107","999999=+Form6!H107","999999=+Form6!H108","999999=+Form6!H109",0,"999999=+Form6!H110","999999=+Form6!J105","999999=+Form6!J106","999999=+Form6!C123",null,"999999=+Form6!D123","999999=+Form6!C124","999999=+Form6!C125","999999=+Form6!C126","999999=+Form6!C127","999999=+Form6!C129","Non-Divested"]
[7,"999999=+MID(CELL(\"filename\",A1),FIND(\"[\",CELL(\"filename\",A1))+1,FIND(\"]\", CELL(\"filename\",A1))-FIND(\"[\",CELL(\"filename\",A1))-1)",null,null,"999999=+Form7!E5",7,"999999=+Form7!C7",null,"999999=+Form7!C8","999999=+Form7!C9","999999=+Form7!C10","999999=+Form7!C11","999999=+Form7!E11","999999=+Form7!F11","999999=+Form7!C12","999999=+Form7!C16","999999=+Form7!C17","999999=+Form7!E17","999999=+Form7!F17","999999=+Form7!C18","999999=+Form7!F18","999999=+Form7!C19","999999=+Form7!C20","999999=+Form7!E20","999999=+Form7!C24","999999=+Form7!C25","999999=+Form7!C26","999999=+Form7!F26","999999=+Form7!C27","999999=+Form7!C28","999999=+Form7!E28","999999=+Form7!F28","999999=+Form7!C29","999999=+Form7!C30","999999=+Form7!C31","999999=+Form7!C32","999999=+Form7!C33","999999=+Form7!C37",null,"999999=+Form7!C38",null,"999999=+Form7!C39",null,"999999=+Form7!C40",null,"999999=+Form7!C41","999999=+Form7!C47","999999=+Form7!C48","999999=+Form7!C49","999999=+Form7!C50","999999=+Form7!C51","999999=+Form7!C52","999999=+Form7!C53","999999=+Form7!C54","999999=+Form7!C55","999999=+Form7!C56","999999=+Form7!C57","999999=+Form7!C58","999999=+Form7!D47","999999=+Form7!D48","999999=+Form7!D49","999999=+Form7!D50","999999=+Form7!D51","999999=+Form7!D52","999999=+Form7!D53","999999=+Form7!D54","999999=+Form7!D55","999999=+Form7!D56","999999=+Form7!D57","999999=+Form7!D58","999999=+Form7!E47","999999=+Form7!E48","999999=+Form7!E49","999999=+Form7!E50","999999=+Form7!E51","999999=+Form7!E52","999999=+Form7!E53","999999=+Form7!E54","999999=+Form7!E55","999999=+Form7!E56","999999=+Form7!E57","999999=+Form7!E58","999999=+Form7!$C$60","999999=+Form7!C64","999999=+Form7!C65",null,"999999=+Form7!C66","999999=+Form7!C67","999999=+Form7!$E$67","999999=+Form7!C68","999999=+Form7!C69","999999=+Form7!E69","999999=+Form7!C70","999999=+Form7!C71","999999=+Form7!C72","999999=+Form7!C73","999999=+Form7!E73","999999=+Form7!C78","999999=+Form7!C79","999999=+Form7!C80","999999=+Form7!D78","999999=+Form7!D79","999999=+Form7!D80","999999=+Form7!E78","999999=+Form7!E79","999999=+Form7!E80","999999=+Form7!C82","999999=+Form7!C95","999999=+Form7!D95","999999=+Form7!C96","999999=+Form7!D96","999999=+Form7!C97","999999=+Form7!D97","999999=+Form7!D98","999999=+Form7!D99",0,"999999=+Form7!D100","999999=+Form7!E95","999999=+Form7!F95","999999=+Form7!E96","999999=+Form7!F96","999999=+Form7!E97","999999=+Form7!F97","999999=+Form7!F98","999999=+Form7!F99",0,"999999=+Form7!F100","999999=+Form7!G95","999999=+Form7!H95","999999=+Form7!G96","999999=+Form7!H96","999999=+Form7!G97","999999=+Form7!H97","999999=+Form7!H98","999999=+Form7!H99",0,"999999=+Form7!H100","999999=+Form7!C105","999999=+Form7!D105","999999=+Form7!C106","999999=+Form7!D106","999999=+Form7!C107","999999=+Form7!D107","999999=+Form7!D108","999999=+Form7!D109",0,"999999=+Form7!D110","999999=+Form7!E105","999999=+Form7!F105","999999=+Form7!E106","999999=+Form7!F106","999999=+Form7!E107","999999=+Form7!F107","999999=+Form7!F108","999999=+Form7!F109",0,"999999=+Form7!F110","999999=+Form7!G105","999999=+Form7!H105","999999=+Form7!G106","999999=+Form7!H106","999999=+Form7!G107","999999=+Form7!H107","999999=+Form7!H108","999999=+Form7!H109",0,"999999=+Form7!H110","999999=+Form7!J105","999999=+Form7!J106","999999=+Form7!C123",null,"999999=+Form7!D123","999999=+Form7!C124","999999=+Form7!C125","999999=+Form7!C126","999999=+Form7!C127","999999=+Form7!C129","Non-Divested"]
[8,"999999=+MID(CELL(\"filename\",A1),FIND(\"[\",CELL(\"filename\",A1))+1,FIND(\"]\", CELL(\"filename\",A1))-FIND(\"[\",CELL(\"filename\",A1))-1)",null,null,"999999=+Form8!E5",8,"999999=+Form8!C7",null,"999999=+Form8!C8","999999=+Form8!C9","999999=+Form8!C10","999999=+Form8!C11","999999=+Form8!E11","999999=+Form8!F11","999999=+Form8!C12","999999=+Form8!C16","999999=+Form8!C17","999999=+Form8!E17","999999=+Form8!F17","999999=+Form8!C18","999999=+Form8!F18","999999=+Form8!C19","999999=+Form8!C20","999999=+Form8!E20","999999=+Form8!C24","999999=+Form8!C25","999999=+Form8!C26","999999=+Form8!F26","999999=+Form8!C27","999999=+Form8!C28","999999=+Form8!E28","999999=+Form8!F28","999999=+Form8!C29","999999=+Form8!C30","999999=+Form8!C31","999999=+Form8!C32","999999=+Form8!C33","999999=+Form8!C37",null,"999999=+Form8!C38",null,"999999=+Form8!C39",null,"999999=+Form8!C40",null,"999999=+Form8!C41","999999=+Form8!C47","999999=+Form8!C48","999999=+Form8!C49","999999=+Form8!C50","999999=+Form8!C51","999999=+Form8!C52","999999=+Form8!C53","999999=+Form8!C54","999999=+Form8!C55","999999=+Form8!C56","999999=+Form8!C57","999999=+Form8!C58","999999=+Form8!D47","999999=+Form8!D48","999999=+Form8!D49","999999=+Form8!D50","999999=+Form8!D51","999999=+Form8!D52","999999=+Form8!D53","999999=+Form8!D54","999999=+Form8!D55","999999=+Form8!D56","999999=+Form8!D57","999999=+Form8!D58","999999=+Form8!E47","999999=+Form8!E48","999999=+Form8!E49","999999=+Form8!E50","999999=+Form8!E51","999999=+Form8!E52","999999=+Form8!E53","999999=+Form8!E54","999999=+Form8!E55","999999=+Form8!E56","999999=+Form8!E57","999999=+Form8!E58","999999=+Form8!$C$60","999999=+Form8!C64","999999=+Form8!C65",null,"999999=+Form8!C66","999999=+Form8!C67","999999=+Form8!$E$67","999999=+Form8!C68","999999=+Form8!C69","999999=+Form8!E69","999999=+Form8!C70","999999=+Form8!C71","999999=+Form8!C72","999999=+Form8!C73","999999=+Form8!E73","999999=+Form8!C78","999999=+Form8!C79","999999=+Form8!C80","999999=+Form8!D78","999999=+Form8!D79","999999=+Form8!D80","999999=+Form8!E78","999999=+Form8!E79","999999=+Form8!E80","999999=+Form8!C82","999999=+Form8!C95","999999=+Form8!D95","999999=+Form8!C96","999999=+Form8!D96","999999=+Form8!C97","999999=+Form8!D97","999999=+Form8!D98","999999=+Form8!D99",0,"999999=+Form8!D100","999999=+Form8!E95","999999=+Form8!F95","999999=+Form8!E96","999999=+Form8!F96","999999=+Form8!E97","999999=+Form8!F97","999999=+Form8!F98","999999=+Form8!F99",0,"999999=+Form8!F100","999999=+Form8!G95","999999=+Form8!H95","999999=+Form8!G96","999999=+Form8!H96","999999=+Form8!G97","999999=+Form8!H97","999999=+Form8!H98","999999=+Form8!H99",0,"999999=+Form8!H100","999999=+Form8!C105","999999=+Form8!D105","999999=+Form8!C106","999999=+Form8!D106","999999=+Form8!C107","999999=+Form8!D107","999999=+Form8!D108","999999=+Form8!D109",0,"999999=+Form8!D110","999999=+Form8!E105","999999=+Form8!F105","999999=+Form8!E106","999999=+Form8!F106","999999=+Form8!E107","999999=+Form8!F107","999999=+Form8!F108","999999=+Form8!F109",0,"999999=+Form8!F110","999999=+Form8!G105","999999=+Form8!H105","999999=+Form8!G106","999999=+Form8!H106","999999=+Form8!G107","999999=+Form8!H107","999999=+Form8!H108","999999=+Form8!H109",0,"999999=+Form8!H110","999999=+Form8!J105","999999=+Form8!J106","999999=+Form8!C123",null,"999999=+Form8!D123","999999=+Form8!C124","999999=+Form8!C125","999999=+Form8!C126","999999=+Form8!C127","999999=+Form8!C129","Non-Divested"]
[9,"999999=+MID(CELL(\"filename\",A1),FIND(\"[\",CELL(\"filename\",A1))+1,FIND(\"]\", CELL(\"filename\",A1))-FIND(\"[\",CELL(\"filename\",A1))-1)",null,null,"999999=+Form9!E5",9,"999999=+Form9!C7",null,"999999=+Form9!C8","999999=+Form9!C9","999999=+Form9!C10","999999=+Form9!C11","999999=+Form9!E11","999999=+Form9!F11","999999=+Form9!C12","999999=+Form9!C16","999999=+Form9!C17","999999=+Form9!E17","999999=+Form9!F17","999999=+Form9!C18","999999=+Form9!F18","999999=+Form9!C19","999999=+Form9!C20","999999=+Form9!E20","999999=+Form9!C24","999999=+Form9!C25","999999=+Form9!C26","999999=+Form9!F26","999999=+Form9!C27","999999=+Form9!C28","999999=+Form9!E28","999999=+Form9!F28","999999=+Form9!C29","999999=+Form9!C30","999999=+Form9!C31","999999=+Form9!C32","999999=+Form9!C33","999999=+Form9!C37",null,"999999=+Form9!C38",null,"999999=+Form9!C39",null,"999999=+Form9!C40",null,"999999=+Form9!C41","999999=+Form9!C47","999999=+Form9!C48","999999=+Form9!C49","999999=+Form9!C50","999999=+Form9!C51","999999=+Form9!C52","999999=+Form9!C53","999999=+Form9!C54","999999=+Form9!C55","999999=+Form9!C56","999999=+Form9!C57","999999=+Form9!C58","999999=+Form9!D47","999999=+Form9!D48","999999=+Form9!D49","999999=+Form9!D50","999999=+Form9!D51","999999=+Form9!D52","999999=+Form9!D53","999999=+Form9!D54","999999=+Form9!D55","999999=+Form9!D56","999999=+Form9!D57","999999=+Form9!D58","999999=+Form9!E47","999999=+Form9!E48","999999=+Form9!E49","999999=+Form9!E50","999999=+Form9!E51","999999=+Form9!E52","999999=+Form9!E53","999999=+Form9!E54","999999=+Form9!E55","999999=+Form9!E56","999999=+Form9!E57","999999=+Form9!E58","999999=+Form9!$C$60","999999=+Form9!C64","999999=+Form9!C65",null,"999999=+Form9!C66","999999=+Form9!C67","999999=+Form9!$E$67","999999=+Form9!C68","999999=+Form9!C69","999999=+Form9!E69","999999=+Form9!C70","999999=+Form9!C71","999999=+Form9!C72","999999=+Form9!C73","999999=+Form9!E73","999999=+Form9!C78","999999=+Form9!C79","999999=+Form9!C80","999999=+Form9!D78","999999=+Form9!D79","999999=+Form9!D80","999999=+Form9!E78","999999=+Form9!E79","999999=+Form9!E80","999999=+Form9!C82","999999=+Form9!C95","999999=+Form9!D95","999999=+Form9!C96","999999=+Form9!D96","999999=+Form9!C97","999999=+Form9!D97","999999=+Form9!D98","999999=+Form9!D99",0,"999999=+Form9!D100","999999=+Form9!E95","999999=+Form9!F95","999999=+Form9!E96","999999=+Form9!F96","999999=+Form9!E97","999999=+Form9!F97","999999=+Form9!F98","999999=+Form9!F99",0,"999999=+Form9!F100","999999=+Form9!G95","999999=+Form9!H95","999999=+Form9!G96","999999=+Form9!H96","999999=+Form9!G97","999999=+Form9!H97","999999=+Form9!H98","999999=+Form9!H99",0,"999999=+Form9!H100","999999=+Form9!C105","999999=+Form9!D105","999999=+Form9!C106","999999=+Form9!D106","999999=+Form9!C107","999999=+Form9!D107","999999=+Form9!D108","999999=+Form9!D109",0,"999999=+Form9!D110","999999=+Form9!E105","999999=+Form9!F105","999999=+Form9!E106","999999=+Form9!F106","999999=+Form9!E107","999999=+Form9!F107","999999=+Form9!F108","999999=+Form9!F109",0,"999999=+Form9!F110","999999=+Form9!G105","999999=+Form9!H105","999999=+Form9!G106","999999=+Form9!H106","999999=+Form9!G107","999999=+Form9!H107","999999=+Form9!H108","999999=+Form9!H109",0,"999999=+Form9!H110","999999=+Form9!J105","999999=+Form9!J106","999999=+Form9!C123",null,"999999=+Form9!D123","999999=+Form9!C124","999999=+Form9!C125","999999=+Form9!C126","999999=+Form9!C127","999999=+Form9!C129","Non-Divested"]
[10,"999999=+MID(CELL(\"filename\",A1),FIND(\"[\",CELL(\"filename\",A1))+1,FIND(\"]\", CELL(\"filename\",A1))-FIND(\"[\",CELL(\"filename\",A1))-1)",null,null,"999999=+Form10!E5",10,"999999=+Form10!C7",null,"999999=+Form10!C8","999999=+Form10!C9","999999=+Form10!C10","999999=+Form10!C11","999999=+Form10!E11","999999=+Form10!F11","999999=+Form10!C12","999999=+Form10!C16","999999=+Form10!C17","999999=+Form10!E17","999999=+Form10!F17","999999=+Form10!C18","999999=+Form10!F18","999999=+Form10!C19","999999=+Form10!C20","999999=+Form10!E20","999999=+Form10!C24","999999=+Form10!C25","999999=+Form10!C26","999999=+Form10!F26","999999=+Form10!C27","999999=+Form10!C28","999999=+Form10!E28","999999=+Form10!F28","999999=+Form10!C29","999999=+Form10!C30","999999=+Form10!C31","999999=+Form10!C32","999999=+Form10!C33","999999=+Form10!C37",null,"999999=+Form10!C38",null,"999999=+Form10!C39",null,"999999=+Form10!C40",null,"999999=+Form10!C41","999999=+Form10!C47","999999=+Form10!C48","999999=+Form10!C49","999999=+Form10!C50","999999=+Form10!C51","999999=+Form10!C52","999999=+Form10!C53","999999=+Form10!C54","999999=+Form10!C55","999999=+Form10!C56","999999=+Form10!C57","999999=+Form10!C58","999999=+Form10!D47","999999=+Form10!D48","999999=+Form10!D49","999999=+Form10!D50","999999=+Form10!D51","999999=+Form10!D52","999999=+Form10!D53","999999=+Form10!D54","999999=+Form10!D55","999999=+Form10!D56","999999=+Form10!D57","999999=+Form10!D58","999999=+Form10!E47","999999=+Form10!E48","999999=+Form10!E49","999999=+Form10!E50","999999=+Form10!E51","999999=+Form10!E52","999999=+Form10!E53","999999=+Form10!E54","999999=+Form10!E55","999999=+Form10!E56","999999=+Form10!E57","999999=+Form10!E58","999999=+Form10!$C$60","999999=+Form10!C64","999999=+Form10!C65",null,"999999=+Form10!C66","999999=+Form10!C67","999999=+Form10!$E$67","999999=+Form10!C68","999999=+Form10!C69","999999=+Form10!E69","999999=+Form10!C70","999999=+Form10!C71","999999=+Form10!C72","999999=+Form10!C73","999999=+Form10!E73","999999=+Form10!C78","999999=+Form10!C79","999999=+Form10!C80","999999=+Form10!D78","999999=+Form10!D79","999999=+Form10!D80","999999=+Form10!E78","999999=+Form10!E79","999999=+Form10!E80","999999=+Form10!C82","999999=+Form10!C95","999999=+Form10!D95","999999=+Form10!C96","999999=+Form10!D96","999999=+Form10!C97","999999=+Form10!D97","999999=+Form10!D98","999999=+Form10!D99",0,"999999=+Form10!D100","999999=+Form10!E95","999999=+Form10!F95","999999=+Form10!E96","999999=+Form10!F96","999999=+Form10!E97","999999=+Form10!F97","999999=+Form10!F98","999999=+Form10!F99",0,"999999=+Form10!F100","999999=+Form10!G95","999999=+Form10!H95","999999=+Form10!G96","999999=+Form10!H96","999999=+Form10!G97","999999=+Form10!H97","999999=+Form10!H98","999999=+Form10!H99",0,"999999=+Form10!H100","999999=+Form10!C105","999999=+Form10!D105","999999=+Form10!C106","999999=+Form10!D106","999999=+Form10!C107","999999=+Form10!D107","999999=+Form10!D108","999999=+Form10!D109",0,"999999=+Form10!D110","999999=+Form10!E105","999999=+Form10!F105","999999=+Form10!E106","999999=+Form10!F106","999999=+Form10!E107","999999=+Form10!F107","999999=+Form10!F108","999999=+Form10!F109",0,"999999=+Form10!F110","999999=+Form10!G105","999999=+Form10!H105","999999=+Form10!G106","999999=+Form10!H106","999999=+Form10!G107","999999=+Form10!H107","999999=+Form10!H108","999999=+Form10!H109",0,"999999=+Form10!H110","999999=+Form10!J105","999999=+Form10!J106","999999=+Form10!C123",null,"999999=+Form10!D123","999999=+Form10!C124","999999=+Form10!C125","999999=+Form10!C126","999999=+Form10!C127","999999=+Form10!C129","Non-Divested"]
[11,"999999=+MID(CELL(\"filename\",A1),FIND(\"[\",CELL(\"filename\",A1))+1,FIND(\"]\", CELL(\"filename\",A1))-FIND(\"[\",CELL(\"filename\",A1))-1)",null,null,"999999=+Form11!E5",11,"999999=+Form11!C7",null,"999999=+Form11!C8","999999=+Form11!C9","999999=+Form11!C10","999999=+Form11!C11","999999=+Form11!E11","999999=+Form11!F11","999999=+Form11!C12","999999=+Form11!C16","999999=+Form11!C17","999999=+Form11!E17","999999=+Form11!F17","999999=+Form11!C18","999999=+Form11!F18","999999=+Form11!C19","999999=+Form11!C20","999999=+Form11!E20","999999=+Form11!C24","999999=+Form11!C25","999999=+Form11!C26","999999=+Form11!F26","999999=+Form11!C27","999999=+Form11!C28","999999=+Form11!E28","999999=+Form11!F28","999999=+Form11!C29","999999=+Form11!C30","999999=+Form11!C31","999999=+Form11!C32","999999=+Form11!C33","999999=+Form11!C37",null,"999999=+Form11!C38",null,"999999=+Form11!C39",null,"999999=+Form11!C40",null,"999999=+Form11!C41","999999=+Form11!C47","999999=+Form11!C48","999999=+Form11!C49","999999=+Form11!C50","999999=+Form11!C51","999999=+Form11!C52","999999=+Form11!C53","999999=+Form11!C54","999999=+Form11!C55","999999=+Form11!C56","999999=+Form11!C57","999999=+Form11!C58","999999=+Form11!D47","999999=+Form11!D48","999999=+Form11!D49","999999=+Form11!D50","999999=+Form11!D51","999999=+Form11!D52","999999=+Form11!D53","999999=+Form11!D54","999999=+Form11!D55","999999=+Form11!D56","999999=+Form11!D57","999999=+Form11!D58","999999=+Form11!E47","999999=+Form11!E48","999999=+Form11!E49","999999=+Form11!E50","999999=+Form11!E51","999999=+Form11!E52","999999=+Form11!E53","999999=+Form11!E54","999999=+Form11!E55","999999=+Form11!E56","999999=+Form11!E57","999999=+Form11!E58","999999=+Form11!$C$60","999999=+Form11!C64","999999=+Form11!C65",null,"999999=+Form11!C66","999999=+Form11!C67","999999=+Form11!$E$67","999999=+Form11!C68","999999=+Form11!C69","999999=+Form11!E69","999999=+Form11!C70","999999=+Form11!C71","999999=+Form11!C72","999999=+Form11!C73","999999=+Form11!E73","999999=+Form11!C78","999999=+Form11!C79","999999=+Form11!C80","999999=+Form11!D78","999999=+Form11!D79","999999=+Form11!D80","999999=+Form11!E78","999999=+Form11!E79","999999=+Form11!E80","999999=+Form11!C82","999999=+Form11!C95","999999=+Form11!D95","999999=+Form11!C96","999999=+Form11!D96","999999=+Form11!C97","999999=+Form11!D97","999999=+Form11!D98","999999=+Form11!D99",0,"999999=+Form11!D100","999999=+Form11!E95","999999=+Form11!F95","999999=+Form11!E96","999999=+Form11!F96","999999=+Form11!E97","999999=+Form11!F97","999999=+Form11!F98","999999=+Form11!F99",0,"999999=+Form11!F100","999999=+Form11!G95","999999=+Form11!H95","999999=+Form11!G96","999999=+Form11!H96","999999=+Form11!G97","999999=+Form11!H97","999999=+Form11!H98","999999=+Form11!H99",0,"999999=+Form11!H100","999999=+Form11!C105","999999=+Form11!D105","999999=+Form11!C106","999999=+Form11!D106","999999=+Form11!C107","999999=+Form11!D107","999999=+Form11!D108","999999=+Form11!D109",0,"999999=+Form11!D110","999999=+Form11!E105","999999=+Form11!F105","999999=+Form11!E106","999999=+Form11!F106","999999=+Form11!E107","999999=+Form11!F107","999999=+Form11!F108","999999=+Form11!F109",0,"999999=+Form11!F110","999999=+Form11!G105","999999=+Form11!H105","999999=+Form11!G106","999999=+Form11!H106","999999=+Form11!G107","999999=+Form11!H107","999999=+Form11!H108","999999=+Form11!H109",0,"999999=+Form11!H110","999999=+Form11!J105","999999=+Form11!J106","999999=+Form11!C123",null,"999999=+Form11!D123","999999=+Form11!C124","999999=+Form11!C125","999999=+Form11!C126","999999=+Form11!C127","999999=+Form11!C129","Non-Divested"]
[12,"999999=+MID(CELL(\"filename\",A1),FIND(\"[\",CELL(\"filename\",A1))+1,FIND(\"]\", CELL(\"filename\",A1))-FIND(\"[\",CELL(\"filename\",A1))-1)",null,null,"999999=+Form12!E5",12,"999999=+Form12!C7",null,"999999=+Form12!C8","999999=+Form12!C9","999999=+Form12!C10","999999=+Form12!C11","999999=+Form12!E11","999999=+Form12!F11","999999=+Form12!C12","999999=+Form12!C16","999999=+Form12!C17","999999=+Form12!E17","999999=+Form12!F17","999999=+Form12!C18","999999=+Form12!F18","999999=+Form12!C19","999999=+Form12!C20","999999=+Form12!E20","999999=+Form12!C24","999999=+Form12!C25","999999=+Form12!C26","999999=+Form12!F26","999999=+Form12!C27","999999=+Form12!C28","999999=+Form12!E28","999999=+Form12!F28","999999=+Form12!C29","999999=+Form12!C30","999999=+Form12!C31","999999=+Form12!C32","999999=+Form12!C33","999999=+Form12!C37",null,"999999=+Form12!C38",null,"999999=+Form12!C39",null,"999999=+Form12!C40",null,"999999=+Form12!C41","999999=+Form12!C47","999999=+Form12!C48","999999=+Form12!C49","999999=+Form12!C50","999999=+Form12!C51","999999=+Form12!C52","999999=+Form12!C53","999999=+Form12!C54","999999=+Form12!C55","999999=+Form12!C56","999999=+Form12!C57","999999=+Form12!C58","999999=+Form12!D47","999999=+Form12!D48","999999=+Form12!D49","999999=+Form12!D50","999999=+Form12!D51","999999=+Form12!D52","999999=+Form12!D53","999999=+Form12!D54","999999=+Form12!D55","999999=+Form12!D56","999999=+Form12!D57","999999=+Form12!D58","999999=+Form12!E47","999999=+Form12!E48","999999=+Form12!E49","999999=+Form12!E50","999999=+Form12!E51","999999=+Form12!E52","999999=+Form12!E53","999999=+Form12!E54","999999=+Form12!E55","999999=+Form12!E56","999999=+Form12!E57","999999=+Form12!E58","999999=+Form12!$C$60","999999=+Form12!C64","999999=+Form12!C65",null,"999999=+Form12!C66","999999=+Form12!C67","999999=+Form12!$E$67","999999=+Form12!C68","999999=+Form12!C69","999999=+Form12!E69","999999=+Form12!C70","999999=+Form12!C71","999999=+Form12!C72","999999=+Form12!C73","999999=+Form12!E73","999999=+Form12!C78","999999=+Form12!C79","999999=+Form12!C80","999999=+Form12!D78","999999=+Form12!D79","999999=+Form12!D80","999999=+Form12!E78","999999=+Form12!E79","999999=+Form12!E80","999999=+Form12!C82","999999=+Form12!C95","999999=+Form12!D95","999999=+Form12!C96","999999=+Form12!D96","999999=+Form12!C97","999999=+Form12!D97","999999=+Form12!D98","999999=+Form12!D99",0,"999999=+Form12!D100","999999=+Form12!E95","999999=+Form12!F95","999999=+Form12!E96","999999=+Form12!F96","999999=+Form12!E97","999999=+Form12!F97","999999=+Form12!F98","999999=+Form12!F99",0,"999999=+Form12!F100","999999=+Form12!G95","999999=+Form12!H95","999999=+Form12!G96","999999=+Form12!H96","999999=+Form12!G97","999999=+Form12!H97","999999=+Form12!H98","999999=+Form12!H99",0,"999999=+Form12!H100","999999=+Form12!C105","999999=+Form12!D105","999999=+Form12!C106","999999=+Form12!D106","999999=+Form12!C107","999999=+Form12!D107","999999=+Form12!D108","999999=+Form12!D109",0,"999999=+Form12!D110","999999=+Form12!E105","999999=+Form12!F105","999999=+Form12!E106","999999=+Form12!F106","999999=+Form12!E107","999999=+Form12!F107","999999=+Form12!F108","999999=+Form12!F109",0,"999999=+Form12!F110","999999=+Form12!G105","999999=+Form12!H105","999999=+Form12!G106","999999=+Form12!H106","999999=+Form12!G107","999999=+Form12!H107","999999=+Form12!H108","999999=+Form12!H109",0,"999999=+Form12!H110","999999=+Form12!J105","999999=+Form12!J106","999999=+Form12!C123",null,"999999=+Form12!D123","999999=+Form12!C124","999999=+Form12!C125","999999=+Form12!C126","999999=+Form12!C127","999999=+Form12!C129","Non-Divested"]
[13,"999999=+MID(CELL(\"filename\",A1),FIND(\"[\",CELL(\"filename\",A1))+1,FIND(\"]\", CELL(\"filename\",A1))-FIND(\"[\",CELL(\"filename\",A1))-1)",null,null,"999999=+Form13!E5",13,"999999=+Form13!C7",null,"999999=+Form13!C8","999999=+Form13!C9","999999=+Form13!C10","999999=+Form13!C11","999999=+Form13!E11","999999=+Form13!F11","999999=+Form13!C12","999999=+Form13!C16","999999=+Form13!C17","999999=+Form13!E17","999999=+Form13!F17","999999=+Form13!C18","999999=+Form13!F18","999999=+Form13!C19","999999=+Form13!C20","999999=+Form13!E20","999999=+Form13!C24","999999=+Form13!C25","999999=+Form13!C26","999999=+Form13!F26","999999=+Form13!C27","999999=+Form13!C28","999999=+Form13!E28","999999=+Form13!F28","999999=+Form13!C29","999999=+Form13!C30","999999=+Form13!C31","999999=+Form13!C32","999999=+Form13!C33","999999=+Form13!C37",null,"999999=+Form13!C38",null,"999999=+Form13!C39",null,"999999=+Form13!C40",null,"999999=+Form13!C41","999999=+Form13!C47","999999=+Form13!C48","999999=+Form13!C49","999999=+Form13!C50","999999=+Form13!C51","999999=+Form13!C52","999999=+Form13!C53","999999=+Form13!C54","999999=+Form13!C55","999999=+Form13!C56","999999=+Form13!C57","999999=+Form13!C58","999999=+Form13!D47","999999=+Form13!D48","999999=+Form13!D49","999999=+Form13!D50","999999=+Form13!D51","999999=+Form13!D52","999999=+Form13!D53","999999=+Form13!D54","999999=+Form13!D55","999999=+Form13!D56","999999=+Form13!D57","999999=+Form13!D58","999999=+Form13!E47","999999=+Form13!E48","999999=+Form13!E49","999999=+Form13!E50","999999=+Form13!E51","999999=+Form13!E52","999999=+Form13!E53","999999=+Form13!E54","999999=+Form13!E55","999999=+Form13!E56","999999=+Form13!E57","999999=+Form13!E58","999999=+Form13!$C$60","999999=+Form13!C64","999999=+Form13!C65",null,"999999=+Form13!C66","999999=+Form13!C67","999999=+Form13!$E$67","999999=+Form13!C68","999999=+Form13!C69","999999=+Form13!E69","999999=+Form13!C70","999999=+Form13!C71","999999=+Form13!C72","999999=+Form13!C73","999999=+Form13!E73","999999=+Form13!C78","999999=+Form13!C79","999999=+Form13!C80","999999=+Form13!D78","999999=+Form13!D79","999999=+Form13!D80","999999=+Form13!E78","999999=+Form13!E79","999999=+Form13!E80","999999=+Form13!C82","999999=+Form13!C95","999999=+Form13!D95","999999=+Form13!C96","999999=+Form13!D96","999999=+Form13!C97","999999=+Form13!D97","999999=+Form13!D98","999999=+Form13!D99",0,"999999=+Form13!D100","999999=+Form13!E95","999999=+Form13!F95","999999=+Form13!E96","999999=+Form13!F96","999999=+Form13!E97","999999=+Form13!F97","999999=+Form13!F98","999999=+Form13!F99",0,"999999=+Form13!F100","999999=+Form13!G95","999999=+Form13!H95","999999=+Form13!G96","999999=+Form13!H96","999999=+Form13!G97","999999=+Form13!H97","999999=+Form13!H98","999999=+Form13!H99",0,"999999=+Form13!H100","999999=+Form13!C105","999999=+Form13!D105","999999=+Form13!C106","999999=+Form13!D106","999999=+Form13!C107","999999=+Form13!D107","999999=+Form13!D108","999999=+Form13!D109",0,"999999=+Form13!D110","999999=+Form13!E105","999999=+Form13!F105","999999=+Form13!E106","999999=+Form13!F106","999999=+Form13!E107","999999=+Form13!F107","999999=+Form13!F108","999999=+Form13!F109",0,"999999=+Form13!F110","999999=+Form13!G105","999999=+Form13!H105","999999=+Form13!G106","999999=+Form13!H106","999999=+Form13!G107","999999=+Form13!H107","999999=+Form13!H108","999999=+Form13!H109",0,"999999=+Form13!H110","999999=+Form13!J105","999999=+Form13!J106","999999=+Form13!C123",null,"999999=+Form13!D123","999999=+Form13!C124","999999=+Form13!C125","999999=+Form13!C126","999999=+Form13!C127","999999=+Form13!C129","Non-Divested"]
[14,"999999=+MID(CELL(\"filename\",A1),FIND(\"[\",CELL(\"filename\",A1))+1,FIND(\"]\", CELL(\"filename\",A1))-FIND(\"[\",CELL(\"filename\",A1))-1)",null,null,"999999=+Form14!E5",14,"999999=+Form14!C7",null,"999999=+Form14!C8","999999=+Form14!C9","999999=+Form14!C10","999999=+Form14!C11","999999=+Form14!E11","999999=+Form14!F11","999999=+Form14!C12","999999=+Form14!C16","999999=+Form14!C17","999999=+Form14!E17","999999=+Form14!F17","999999=+Form14!C18","999999=+Form14!F18","999999=+Form14!C19","999999=+Form14!C20","999999=+Form14!E20","999999=+Form14!C24","999999=+Form14!C25","999999=+Form14!C26","999999=+Form14!F26","999999=+Form14!C27","999999=+Form14!C28","999999=+Form14!E28","999999=+Form14!F28","999999=+Form14!C29","999999=+Form14!C30","999999=+Form14!C31","999999=+Form14!C32","999999=+Form14!C33","999999=+Form14!C37",null,"999999=+Form14!C38",null,"999999=+Form14!C39",null,"999999=+Form14!C40",null,"999999=+Form14!C41","999999=+Form14!C47","999999=+Form14!C48","999999=+Form14!C49","999999=+Form14!C50","999999=+Form14!C51","999999=+Form14!C52","999999=+Form14!C53","999999=+Form14!C54","999999=+Form14!C55","999999=+Form14!C56","999999=+Form14!C57","999999=+Form14!C58","999999=+Form14!D47","999999=+Form14!D48","999999=+Form14!D49","999999=+Form14!D50","999999=+Form14!D51","999999=+Form14!D52","999999=+Form14!D53","999999=+Form14!D54","999999=+Form14!D55","999999=+Form14!D56","999999=+Form14!D57","999999=+Form14!D58","999999=+Form14!E47","999999=+Form14!E48","999999=+Form14!E49","999999=+Form14!E50","999999=+Form14!E51","999999=+Form14!E52","999999=+Form14!E53","999999=+Form14!E54","999999=+Form14!E55","999999=+Form14!E56","999999=+Form14!E57","999999=+Form14!E58","999999=+Form14!$C$60","999999=+Form14!C64","999999=+Form14!C65",null,"999999=+Form14!C66","999999=+Form14!C67","999999=+Form14!$E$67","999999=+Form14!C68","999999=+Form14!C69","999999=+Form14!E69","999999=+Form14!C70","999999=+Form14!C71","999999=+Form14!C72","999999=+Form14!C73","999999=+Form14!E73","999999=+Form14!C78","999999=+Form14!C79","999999=+Form14!C80","999999=+Form14!D78","999999=+Form14!D79","999999=+Form14!D80","999999=+Form14!E78","999999=+Form14!E79","999999=+Form14!E80","999999=+Form14!C82","999999=+Form14!C95","999999=+Form14!D95","999999=+Form14!C96","999999=+Form14!D96","999999=+Form14!C97","999999=+Form14!D97","999999=+Form14!D98","999999=+Form14!D99",0,"999999=+Form14!D100","999999=+Form14!E95","999999=+Form14!F95","999999=+Form14!E96","999999=+Form14!F96","999999=+Form14!E97","999999=+Form14!F97","999999=+Form14!F98","999999=+Form14!F99",0,"999999=+Form14!F100","999999=+Form14!G95","999999=+Form14!H95","999999=+Form14!G96","999999=+Form14!H96","999999=+Form14!G97","999999=+Form14!H97","999999=+Form14!H98","999999=+Form14!H99",0,"999999=+Form14!H100","999999=+Form14!C105","999999=+Form14!D105","999999=+Form14!C106","999999=+Form14!D106","999999=+Form14!C107","999999=+Form14!D107","999999=+Form14!D108","999999=+Form14!D109",0,"999999=+Form14!D110","999999=+Form14!E105","999999=+Form14!F105","999999=+Form14!E106","999999=+Form14!F106","999999=+Form14!E107","999999=+Form14!F107","999999=+Form14!F108","999999=+Form14!F109",0,"999999=+Form14!F110","999999=+Form14!G105","999999=+Form14!H105","999999=+Form14!G106","999999=+Form14!H106","999999=+Form14!G107","999999=+Form14!H107","999999=+Form14!H108","999999=+Form14!H109",0,"999999=+Form14!H110","999999=+Form14!J105","999999=+Form14!J106","999999=+Form14!C123",null,"999999=+Form14!D123","999999=+Form14!C124","999999=+Form14!C125","999999=+Form14!C126","999999=+Form14!C127","999999=+Form14!C129","Non-Divested"]
[15,"999999=+MID(CELL(\"filename\",A1),FIND(\"[\",CELL(\"filename\",A1))+1,FIND(\"]\", CELL(\"filename\",A1))-FIND(\"[\",CELL(\"filename\",A1))-1)",null,null,"999999=+Form15!E5",15,"999999=+Form15!C7",null,"999999=+Form15!C8","999999=+Form15!C9","999999=+Form15!C10","999999=+Form15!C11","999999=+Form15!E11","999999=+Form15!F11","999999=+Form15!C12","999999=+Form15!C16","999999=+Form15!C17","999999=+Form15!E17","999999=+Form15!F17","999999=+Form15!C18","999999=+Form15!F18","999999=+Form15!C19","999999=+Form15!C20","999999=+Form15!E20","999999=+Form15!C24","999999=+Form15!C25","999999=+Form15!C26","999999=+Form15!F26","999999=+Form15!C27","999999=+Form15!C28","999999=+Form15!E28","999999=+Form15!F28","999999=+Form15!C29","999999=+Form15!C30","999999=+Form15!C31","999999=+Form15!C32","999999=+Form15!C33","999999=+Form15!C37",null,"999999=+Form15!C38",null,"999999=+Form15!C39",null,"999999=+Form15!C40",null,"999999=+Form15!C41","999999=+Form15!C47","999999=+Form15!C48","999999=+Form15!C49","999999=+Form15!C50","999999=+Form15!C51","999999=+Form15!C52","999999=+Form15!C53","999999=+Form15!C54","999999=+Form15!C55","999999=+Form15!C56","999999=+Form15!C57","999999=+Form15!C58","999999=+Form15!D47","999999=+Form15!D48","999999=+Form15!D49","999999=+Form15!D50","999999=+Form15!D51","999999=+Form15!D52","999999=+Form15!D53","999999=+Form15!D54","999999=+Form15!D55","999999=+Form15!D56","999999=+Form15!D57","999999=+Form15!D58","999999=+Form15!E47","999999=+Form15!E48","999999=+Form15!E49","999999=+Form15!E50","999999=+Form15!E51","999999=+Form15!E52","999999=+Form15!E53","999999=+Form15!E54","999999=+Form15!E55","999999=+Form15!E56","999999=+Form15!E57","999999=+Form15!E58","999999=+Form15!$C$60","999999=+Form15!C64","999999=+Form15!C65",null,"999999=+Form15!C66","999999=+Form15!C67","999999=+Form15!$E$67","999999=+Form15!C68","999999=+Form15!C69","999999=+Form15!E69","999999=+Form15!C70","999999=+Form15!C71","999999=+Form15!C72","999999=+Form15!C73","999999=+Form15!E73","999999=+Form15!C78","999999=+Form15!C79","999999=+Form15!C80","999999=+Form15!D78","999999=+Form15!D79","999999=+Form15!D80","999999=+Form15!E78","999999=+Form15!E79","999999=+Form15!E80","999999=+Form15!C82","999999=+Form15!C95","999999=+Form15!D95","999999=+Form15!C96","999999=+Form15!D96","999999=+Form15!C97","999999=+Form15!D97","999999=+Form15!D98","999999=+Form15!D99",0,"999999=+Form15!D100","999999=+Form15!E95","999999=+Form15!F95","999999=+Form15!E96","999999=+Form15!F96","999999=+Form15!E97","999999=+Form15!F97","999999=+Form15!F98","999999=+Form15!F99",0,"999999=+Form15!F100","999999=+Form15!G95","999999=+Form15!H95","999999=+Form15!G96","999999=+Form15!H96","999999=+Form15!G97","999999=+Form15!H97","999999=+Form15!H98","999999=+Form15!H99",0,"999999=+Form15!H100","999999=+Form15!C105","999999=+Form15!D105","999999=+Form15!C106","999999=+Form15!D106","999999=+Form15!C107","999999=+Form15!D107","999999=+Form15!D108","999999=+Form15!D109",0,"999999=+Form15!D110","999999=+Form15!E105","999999=+Form15!F105","999999=+Form15!E106","999999=+Form15!F106","999999=+Form15!E107","999999=+Form15!F107","999999=+Form15!F108","999999=+Form15!F109",0,"999999=+Form15!F110","999999=+Form15!G105","999999=+Form15!H105","999999=+Form15!G106","999999=+Form15!H106","999999=+Form15!G107","999999=+Form15!H107","999999=+Form15!H108","999999=+Form15!H109",0,"999999=+Form15!H110","999999=+Form15!J105","999999=+Form15!J106","999999=+Form15!C123",null,"999999=+Form15!D123","999999=+Form15!C124","999999=+Form15!C125","999999=+Form15!C126","999999=+Form15!C127","999999=+Form15!C129","Non-Divested"]
[16,"999999=+MID(CELL(\"filename\",A1),FIND(\"[\",CELL(\"filename\",A1))+1,FIND(\"]\", CELL(\"filename\",A1))-FIND(\"[\",CELL(\"filename\",A1))-1)",null,null,"999999=+Form16!E5",16,"999999=+Form16!C7",null,"999999=+Form16!C8","999999=+Form16!C9","999999=+Form16!C10","999999=+Form16!C11","999999=+Form16!E11","999999=+Form16!F11","999999=+Form16!C12","999999=+Form16!C16","999999=+Form16!C17","999999=+Form16!E17","999999=+Form16!F17","999999=+Form16!C18","999999=+Form16!F18","999999=+Form16!C19","999999=+Form16!C20","999999=+Form16!E20","999999=+Form16!C24","999999=+Form16!C25","999999=+Form16!C26","999999=+Form16!F26","999999=+Form16!C27","999999=+Form16!C28","999999=+Form16!E28","999999=+Form16!F28","999999=+Form16!C29","999999=+Form16!C30","999999=+Form16!C31","999999=+Form16!C32","999999=+Form16!C33","999999=+Form16!C37",null,"999999=+Form16!C38",null,"999999=+Form16!C39",null,"999999=+Form16!C40",null,"999999=+Form16!C41","999999=+Form16!C47","999999=+Form16!C48","999999=+Form16!C49","999999=+Form16!C50","999999=+Form16!C51","999999=+Form16!C52","999999=+Form16!C53","999999=+Form16!C54","999999=+Form16!C55","999999=+Form16!C56","999999=+Form16!C57","999999=+Form16!C58","999999=+Form16!D47","999999=+Form16!D48","999999=+Form16!D49","999999=+Form16!D50","999999=+Form16!D51","999999=+Form16!D52","999999=+Form16!D53","999999=+Form16!D54","999999=+Form16!D55","999999=+Form16!D56","999999=+Form16!D57","999999=+Form16!D58","999999=+Form16!E47","999999=+Form16!E48","999999=+Form16!E49","999999=+Form16!E50","999999=+Form16!E51","999999=+Form16!E52","999999=+Form16!E53","999999=+Form16!E54","999999=+Form16!E55","999999=+Form16!E56","999999=+Form16!E57","999999=+Form16!E58","999999=+Form16!$C$60","999999=+Form16!C64","999999=+Form16!C65",null,"999999=+Form16!C66","999999=+Form16!C67","999999=+Form16!$E$67","999999=+Form16!C68","999999=+Form16!C69","999999=+Form16!E69","999999=+Form16!C70","999999=+Form16!C71","999999=+Form16!C72","999999=+Form16!C73","999999=+Form16!E73","999999=+Form16!C78","999999=+Form16!C79","999999=+Form16!C80","999999=+Form16!D78","999999=+Form16!D79","999999=+Form16!D80","999999=+Form16!E78","999999=+Form16!E79","999999=+Form16!E80","999999=+Form16!C82","999999=+Form16!C95","999999=+Form16!D95","999999=+Form16!C96","999999=+Form16!D96","999999=+Form16!C97","999999=+Form16!D97","999999=+Form16!D98","999999=+Form16!D99",0,"999999=+Form16!D100","999999=+Form16!E95","999999=+Form16!F95","999999=+Form16!E96","999999=+Form16!F96","999999=+Form16!E97","999999=+Form16!F97","999999=+Form16!F98","999999=+Form16!F99",0,"999999=+Form16!F100","999999=+Form16!G95","999999=+Form16!H95","999999=+Form16!G96","999999=+Form16!H96","999999=+Form16!G97","999999=+Form16!H97","999999=+Form16!H98","999999=+Form16!H99",0,"999999=+Form16!H100","999999=+Form16!C105","999999=+Form16!D105","999999=+Form16!C106","999999=+Form16!D106","999999=+Form16!C107","999999=+Form16!D107","999999=+Form16!D108","999999=+Form16!D109",0,"999999=+Form16!D110","999999=+Form16!E105","999999=+Form16!F105","999999=+Form16!E106","999999=+Form16!F106","999999=+Form16!E107","999999=+Form16!F107","999999=+Form16!F108","999999=+Form16!F109",0,"999999=+Form16!F110","999999=+Form16!G105","999999=+Form16!H105","999999=+Form16!G106","999999=+Form16!H106","999999=+Form16!G107","999999=+Form16!H107","999999=+Form16!H108","999999=+Form16!H109",0,"999999=+Form16!H110","999999=+Form16!J105","999999=+Form16!J106","999999=+Form16!C123",null,"999999=+Form16!D123","999999=+Form16!C124","999999=+Form16!C125","999999=+Form16!C126","999999=+Form16!C127","999999=+Form16!C129","Non-Divested"]
[17,"999999=+MID(CELL(\"filename\",A1),FIND(\"[\",CELL(\"filename\",A1))+1,FIND(\"]\", CELL(\"filename\",A1))-FIND(\"[\",CELL(\"filename\",A1))-1)",null,null,"999999=+Form17!E5",17,"999999=+Form17!C7",null,"999999=+Form17!C8","999999=+Form17!C9","999999=+Form17!C10","999999=+Form17!C11","999999=+Form17!E11","999999=+Form17!F11","999999=+Form17!C12","999999=+Form17!C16","999999=+Form17!C17","999999=+Form17!E17","999999=+Form17!F17","999999=+Form17!C18","999999=+Form17!F18","999999=+Form17!C19","999999=+Form17!C20","999999=+Form17!E20","999999=+Form17!C24","999999=+Form17!C25","999999=+Form17!C26","999999=+Form17!F26","999999=+Form17!C27","999999=+Form17!C28","999999=+Form17!E28","999999=+Form17!F28","999999=+Form17!C29","999999=+Form17!C30","999999=+Form17!C31","999999=+Form17!C32","999999=+Form17!C33","999999=+Form17!C37",null,"999999=+Form17!C38",null,"999999=+Form17!C39",null,"999999=+Form17!C40",null,"999999=+Form17!C41","999999=+Form17!C47","999999=+Form17!C48","999999=+Form17!C49","999999=+Form17!C50","999999=+Form17!C51","999999=+Form17!C52","999999=+Form17!C53","999999=+Form17!C54","999999=+Form17!C55","999999=+Form17!C56","999999=+Form17!C57","999999=+Form17!C58","999999=+Form17!D47","999999=+Form17!D48","999999=+Form17!D49","999999=+Form17!D50","999999=+Form17!D51","999999=+Form17!D52","999999=+Form17!D53","999999=+Form17!D54","999999=+Form17!D55","999999=+Form17!D56","999999=+Form17!D57","999999=+Form17!D58","999999=+Form17!E47","999999=+Form17!E48","999999=+Form17!E49","999999=+Form17!E50","999999=+Form17!E51","999999=+Form17!E52","999999=+Form17!E53","999999=+Form17!E54","999999=+Form17!E55","999999=+Form17!E56","999999=+Form17!E57","999999=+Form17!E58","999999=+Form17!$C$60","999999=+Form17!C64","999999=+Form17!C65",null,"999999=+Form17!C66","999999=+Form17!C67","999999=+Form17!$E$67","999999=+Form17!C68","999999=+Form17!C69","999999=+Form17!E69","999999=+Form17!C70","999999=+Form17!C71","999999=+Form17!C72","999999=+Form17!C73","999999=+Form17!E73","999999=+Form17!C78","999999=+Form17!C79","999999=+Form17!C80","999999=+Form17!D78","999999=+Form17!D79","999999=+Form17!D80","999999=+Form17!E78","999999=+Form17!E79","999999=+Form17!E80","999999=+Form17!C82","999999=+Form17!C95","999999=+Form17!D95","999999=+Form17!C96","999999=+Form17!D96","999999=+Form17!C97","999999=+Form17!D97","999999=+Form17!D98","999999=+Form17!D99",0,"999999=+Form17!D100","999999=+Form17!E95","999999=+Form17!F95","999999=+Form17!E96","999999=+Form17!F96","999999=+Form17!E97","999999=+Form17!F97","999999=+Form17!F98","999999=+Form17!F99",0,"999999=+Form17!F100","999999=+Form17!G95","999999=+Form17!H95","999999=+Form17!G96","999999=+Form17!H96","999999=+Form17!G97","999999=+Form17!H97","999999=+Form17!H98","999999=+Form17!H99",0,"999999=+Form17!H100","999999=+Form17!C105","999999=+Form17!D105","999999=+Form17!C106","999999=+Form17!D106","999999=+Form17!C107","999999=+Form17!D107","999999=+Form17!D108","999999=+Form17!D109",0,"999999=+Form17!D110","999999=+Form17!E105","999999=+Form17!F105","999999=+Form17!E106","999999=+Form17!F106","999999=+Form17!E107","999999=+Form17!F107","999999=+Form17!F108","999999=+Form17!F109",0,"999999=+Form17!F110","999999=+Form17!G105","999999=+Form17!H105","999999=+Form17!G106","999999=+Form17!H106","999999=+Form17!G107","999999=+Form17!H107","999999=+Form17!H108","999999=+Form17!H109",0,"999999=+Form17!H110","999999=+Form17!J105","999999=+Form17!J106","999999=+Form17!C123",null,"999999=+Form17!D123","999999=+Form17!C124","999999=+Form17!C125","999999=+Form17!C126","999999=+Form17!C127","999999=+Form17!C129","Non-Divested"]
[18,"999999=+MID(CELL(\"filename\",A1),FIND(\"[\",CELL(\"filename\",A1))+1,FIND(\"]\", CELL(\"filename\",A1))-FIND(\"[\",CELL(\"filename\",A1))-1)",null,null,"999999=+Form18!E5",18,"999999=+Form18!C7",null,"999999=+Form18!C8","999999=+Form18!C9","999999=+Form18!C10","999999=+Form18!C11","999999=+Form18!E11","999999=+Form18!F11","999999=+Form18!C12","999999=+Form18!C16","999999=+Form18!C17","999999=+Form18!E17","999999=+Form18!F17","999999=+Form18!C18","999999=+Form18!F18","999999=+Form18!C19","999999=+Form18!C20","999999=+Form18!E20","999999=+Form18!C24","999999=+Form18!C25","999999=+Form18!C26","999999=+Form18!F26","999999=+Form18!C27","999999=+Form18!C28","999999=+Form18!E28","999999=+Form18!F28","999999=+Form18!C29","999999=+Form18!C30","999999=+Form18!C31","999999=+Form18!C32","999999=+Form18!C33","999999=+Form18!C37",null,"999999=+Form18!C38",null,"999999=+Form18!C39",null,"999999=+Form18!C40",null,"999999=+Form18!C41","999999=+Form18!C47","999999=+Form18!C48","999999=+Form18!C49","999999=+Form18!C50","999999=+Form18!C51","999999=+Form18!C52","999999=+Form18!C53","999999=+Form18!C54","999999=+Form18!C55","999999=+Form18!C56","999999=+Form18!C57","999999=+Form18!C58","999999=+Form18!D47","999999=+Form18!D48","999999=+Form18!D49","999999=+Form18!D50","999999=+Form18!D51","999999=+Form18!D52","999999=+Form18!D53","999999=+Form18!D54","999999=+Form18!D55","999999=+Form18!D56","999999=+Form18!D57","999999=+Form18!D58","999999=+Form18!E47","999999=+Form18!E48","999999=+Form18!E49","999999=+Form18!E50","999999=+Form18!E51","999999=+Form18!E52","999999=+Form18!E53","999999=+Form18!E54","999999=+Form18!E55","999999=+Form18!E56","999999=+Form18!E57","999999=+Form18!E58","999999=+Form18!$C$60","999999=+Form18!C64","999999=+Form18!C65",null,"999999=+Form18!C66","999999=+Form18!C67","999999=+Form18!$E$67","999999=+Form18!C68","999999=+Form18!C69","999999=+Form18!E69","999999=+Form18!C70","999999=+Form18!C71","999999=+Form18!C72","999999=+Form18!C73","999999=+Form18!E73","999999=+Form18!C78","999999=+Form18!C79","999999=+Form18!C80","999999=+Form18!D78","999999=+Form18!D79","999999=+Form18!D80","999999=+Form18!E78","999999=+Form18!E79","999999=+Form18!E80","999999=+Form18!C82","999999=+Form18!C95","999999=+Form18!D95","999999=+Form18!C96","999999=+Form18!D96","999999=+Form18!C97","999999=+Form18!D97","999999=+Form18!D98","999999=+Form18!D99",0,"999999=+Form18!D100","999999=+Form18!E95","999999=+Form18!F95","999999=+Form18!E96","999999=+Form18!F96","999999=+Form18!E97","999999=+Form18!F97","999999=+Form18!F98","999999=+Form18!F99",0,"999999=+Form18!F100","999999=+Form18!G95","999999=+Form18!H95","999999=+Form18!G96","999999=+Form18!H96","999999=+Form18!G97","999999=+Form18!H97","999999=+Form18!H98","999999=+Form18!H99",0,"999999=+Form18!H100","999999=+Form18!C105","999999=+Form18!D105","999999=+Form18!C106","999999=+Form18!D106","999999=+Form18!C107","999999=+Form18!D107","999999=+Form18!D108","999999=+Form18!D109",0,"999999=+Form18!D110","999999=+Form18!E105","999999=+Form18!F105","999999=+Form18!E106","999999=+Form18!F106","999999=+Form18!E107","999999=+Form18!F107","999999=+Form18!F108","999999=+Form18!F109",0,"999999=+Form18!F110","999999=+Form18!G105","999999=+Form18!H105","999999=+Form18!G106","999999=+Form18!H106","999999=+Form18!G107","999999=+Form18!H107","999999=+Form18!H108","999999=+Form18!H109",0,"999999=+Form18!H110","999999=+Form18!J105","999999=+Form18!J106","999999=+Form18!C123",null,"999999=+Form18!D123","999999=+Form18!C124","999999=+Form18!C125","999999=+Form18!C126","999999=+Form18!C127","999999=+Form18!C129","Non-Divested"]
[19,"999999=+MID(CELL(\"filename\",A1),FIND(\"[\",CELL(\"filename\",A1))+1,FIND(\"]\", CELL(\"filename\",A1))-FIND(\"[\",CELL(\"filename\",A1))-1)",null,null,"999999=+Form19!E5",19,"999999=+Form19!C7",null,"999999=+Form19!C8","999999=+Form19!C9","999999=+Form19!C10","999999=+Form19!C11","999999=+Form19!E11","999999=+Form19!F11","999999=+Form19!C12","999999=+Form19!C16","999999=+Form19!C17","999999=+Form19!E17","999999=+Form19!F17","999999=+Form19!C18","999999=+Form19!F18","999999=+Form19!C19","999999=+Form19!C20","999999=+Form19!E20","999999=+Form19!C24","999999=+Form19!C25","999999=+Form19!C26","999999=+Form19!F26","999999=+Form19!C27","999999=+Form19!C28","999999=+Form19!E28","999999=+Form19!F28","999999=+Form19!C29","999999=+Form19!C30","999999=+Form19!C31","999999=+Form19!C32","999999=+Form19!C33","999999=+Form19!C37",null,"999999=+Form19!C38",null,"999999=+Form19!C39",null,"999999=+Form19!C40",null,"999999=+Form19!C41","999999=+Form19!C47","999999=+Form19!C48","999999=+Form19!C49","999999=+Form19!C50","999999=+Form19!C51","999999=+Form19!C52","999999=+Form19!C53","999999=+Form19!C54","999999=+Form19!C55","999999=+Form19!C56","999999=+Form19!C57","999999=+Form19!C58","999999=+Form19!D47","999999=+Form19!D48","999999=+Form19!D49","999999=+Form19!D50","999999=+Form19!D51","999999=+Form19!D52","999999=+Form19!D53","999999=+Form19!D54","999999=+Form19!D55","999999=+Form19!D56","999999=+Form19!D57","999999=+Form19!D58","999999=+Form19!E47","999999=+Form19!E48","999999=+Form19!E49","999999=+Form19!E50","999999=+Form19!E51","999999=+Form19!E52","999999=+Form19!E53","999999=+Form19!E54","999999=+Form19!E55","999999=+Form19!E56","999999=+Form19!E57","999999=+Form19!E58","999999=+Form19!$C$60","999999=+Form19!C64","999999=+Form19!C65",null,"999999=+Form19!C66","999999=+Form19!C67","999999=+Form19!$E$67","999999=+Form19!C68","999999=+Form19!C69","999999=+Form19!E69","999999=+Form19!C70","999999=+Form19!C71","999999=+Form19!C72","999999=+Form19!C73","999999=+Form19!E73","999999=+Form19!C78","999999=+Form19!C79","999999=+Form19!C80","999999=+Form19!D78","999999=+Form19!D79","999999=+Form19!D80","999999=+Form19!E78","999999=+Form19!E79","999999=+Form19!E80","999999=+Form19!C82","999999=+Form19!C95","999999=+Form19!D95","999999=+Form19!C96","999999=+Form19!D96","999999=+Form19!C97","999999=+Form19!D97","999999=+Form19!D98","999999=+Form19!D99",0,"999999=+Form19!D100","999999=+Form19!E95","999999=+Form19!F95","999999=+Form19!E96","999999=+Form19!F96","999999=+Form19!E97","999999=+Form19!F97","999999=+Form19!F98","999999=+Form19!F99",0,"999999=+Form19!F100","999999=+Form19!G95","999999=+Form19!H95","999999=+Form19!G96","999999=+Form19!H96","999999=+Form19!G97","999999=+Form19!H97","999999=+Form19!H98","999999=+Form19!H99",0,"999999=+Form19!H100","999999=+Form19!C105","999999=+Form19!D105","999999=+Form19!C106","999999=+Form19!D106","999999=+Form19!C107","999999=+Form19!D107","999999=+Form19!D108","999999=+Form19!D109",0,"999999=+Form19!D110","999999=+Form19!E105","999999=+Form19!F105","999999=+Form19!E106","999999=+Form19!F106","999999=+Form19!E107","999999=+Form19!F107","999999=+Form19!F108","999999=+Form19!F109",0,"999999=+Form19!F110","999999=+Form19!G105","999999=+Form19!H105","999999=+Form19!G106","999999=+Form19!H106","999999=+Form19!G107","999999=+Form19!H107","999999=+Form19!H108","999999=+Form19!H109",0,"999999=+Form19!H110","999999=+Form19!J105","999999=+Form19!J106","999999=+Form19!C123",null,"999999=+Form19!D123","999999=+Form19!C124","999999=+Form19!C125","999999=+Form19!C126","999999=+Form19!C127","999999=+Form19!C129","Non-Divested"]
[20,"999999=+MID(CELL(\"filename\",A1),FIND(\"[\",CELL(\"filename\",A1))+1,FIND(\"]\", CELL(\"filename\",A1))-FIND(\"[\",CELL(\"filename\",A1))-1)",null,null,"999999=+Form20!E5",20,"999999=+Form20!C7",null,"999999=+Form20!C8","999999=+Form20!C9","999999=+Form20!C10","999999=+Form20!C11","999999=+Form20!E11","999999=+Form20!F11","999999=+Form20!C12","999999=+Form20!C16","999999=+Form20!C17","999999=+Form20!E17","999999=+Form20!F17","999999=+Form20!C18","999999=+Form20!F18","999999=+Form20!C19","999999=+Form20!C20","999999=+Form20!E20","999999=+Form20!C24","999999=+Form20!C25","999999=+Form20!C26","999999=+Form20!F26","999999=+Form20!C27","999999=+Form20!C28","999999=+Form20!E28","999999=+Form20!F28","999999=+Form20!C29","999999=+Form20!C30","999999=+Form20!C31","999999=+Form20!C32","999999=+Form20!C33","999999=+Form20!C37",null,"999999=+Form20!C38",null,"999999=+Form20!C39",null,"999999=+Form20!C40",null,"999999=+Form20!C41","999999=+Form20!C47","999999=+Form20!C48","999999=+Form20!C49","999999=+Form20!C50","999999=+Form20!C51","999999=+Form20!C52","999999=+Form20!C53","999999=+Form20!C54","999999=+Form20!C55","999999=+Form20!C56","999999=+Form20!C57","999999=+Form20!C58","999999=+Form20!D47","999999=+Form20!D48","999999=+Form20!D49","999999=+Form20!D50","999999=+Form20!D51","999999=+Form20!D52","999999=+Form20!D53","999999=+Form20!D54","999999=+Form20!D55","999999=+Form20!D56","999999=+Form20!D57","999999=+Form20!D58","999999=+Form20!E47","999999=+Form20!E48","999999=+Form20!E49","999999=+Form20!E50","999999=+Form20!E51","999999=+Form20!E52","999999=+Form20!E53","999999=+Form20!E54","999999=+Form20!E55","999999=+Form20!E56","999999=+Form20!E57","999999=+Form20!E58","999999=+Form20!$C$60","999999=+Form20!C64","999999=+Form20!C65",null,"999999=+Form20!C66","999999=+Form20!C67","999999=+Form20!$E$67","999999=+Form20!C68","999999=+Form20!C69","999999=+Form20!E69","999999=+Form20!C70","999999=+Form20!C71","999999=+Form20!C72","999999=+Form20!C73","999999=+Form20!E73","999999=+Form20!C78","999999=+Form20!C79","999999=+Form20!C80","999999=+Form20!D78","999999=+Form20!D79","999999=+Form20!D80","999999=+Form20!E78","999999=+Form20!E79","999999=+Form20!E80","999999=+Form20!C82","999999=+Form20!C95","999999=+Form20!D95","999999=+Form20!C96","999999=+Form20!D96","999999=+Form20!C97","999999=+Form20!D97","999999=+Form20!D98","999999=+Form20!D99",0,"999999=+Form20!D100","999999=+Form20!E95","999999=+Form20!F95","999999=+Form20!E96","999999=+Form20!F96","999999=+Form20!E97","999999=+Form20!F97","999999=+Form20!F98","999999=+Form20!F99",0,"999999=+Form20!F100","999999=+Form20!G95","999999=+Form20!H95","999999=+Form20!G96","999999=+Form20!H96","999999=+Form20!G97","999999=+Form20!H97","999999=+Form20!H98","999999=+Form20!H99",0,"999999=+Form20!H100","999999=+Form20!C105","999999=+Form20!D105","999999=+Form20!C106","999999=+Form20!D106","999999=+Form20!C107","999999=+Form20!D107","999999=+Form20!D108","999999=+Form20!D109",0,"999999=+Form20!D110","999999=+Form20!E105","999999=+Form20!F105","999999=+Form20!E106","999999=+Form20!F106","999999=+Form20!E107","999999=+Form20!F107","999999=+Form20!F108","999999=+Form20!F109",0,"999999=+Form20!F110","999999=+Form20!G105","999999=+Form20!H105","999999=+Form20!G106","999999=+Form20!H106","999999=+Form20!G107","999999=+Form20!H107","999999=+Form20!H108","999999=+Form20!H109",0,"999999=+Form20!H110","999999=+Form20!J105","999999=+Form20!J106","999999=+Form20!C123",null,"999999=+Form20!D123","999999=+Form20!C124","999999=+Form20!C125","999999=+Form20!C126","999999=+Form20!C127","999999=+Form20!C129","Non-Divested"]
[21,"999999=+MID(CELL(\"filename\",A1),FIND(\"[\",CELL(\"filename\",A1))+1,FIND(\"]\", CELL(\"filename\",A1))-FIND(\"[\",CELL(\"filename\",A1))-1)",null,null,"999999=+Form21!E5",21,"999999=+Form21!C7",null,"999999=+Form21!C8","999999=+Form21!C9","999999=+Form21!C10","999999=+Form21!C11","999999=+Form21!E11","999999=+Form21!F11","999999=+Form21!C12","999999=+Form21!C16","999999=+Form21!C17","999999=+Form21!E17","999999=+Form21!F17","999999=+Form21!C18","999999=+Form21!F18","999999=+Form21!C19","999999=+Form21!C20","999999=+Form21!E20","999999=+Form21!C24","999999=+Form21!C25","999999=+Form21!C26","999999=+Form21!F26","999999=+Form21!C27","999999=+Form21!C28","999999=+Form21!E28","999999=+Form21!F28","999999=+Form21!C29","999999=+Form21!C30","999999=+Form21!C31","999999=+Form21!C32","999999=+Form21!C33","999999=+Form21!C37",null,"999999=+Form21!C38",null,"999999=+Form21!C39",null,"999999=+Form21!C40",null,"999999=+Form21!C41","999999=+Form21!C47","999999=+Form21!C48","999999=+Form21!C49","999999=+Form21!C50","999999=+Form21!C51","999999=+Form21!C52","999999=+Form21!C53","999999=+Form21!C54","999999=+Form21!C55","999999=+Form21!C56","999999=+Form21!C57","999999=+Form21!C58","999999=+Form21!D47","999999=+Form21!D48","999999=+Form21!D49","999999=+Form21!D50","999999=+Form21!D51","999999=+Form21!D52","999999=+Form21!D53","999999=+Form21!D54","999999=+Form21!D55","999999=+Form21!D56","999999=+Form21!D57","999999=+Form21!D58","999999=+Form21!E47","999999=+Form21!E48","999999=+Form21!E49","999999=+Form21!E50","999999=+Form21!E51","999999=+Form21!E52","999999=+Form21!E53","999999=+Form21!E54","999999=+Form21!E55","999999=+Form21!E56","999999=+Form21!E57","999999=+Form21!E58","999999=+Form21!$C$60","999999=+Form21!C64","999999=+Form21!C65",null,"999999=+Form21!C66","999999=+Form21!C67","999999=+Form21!$E$67","999999=+Form21!C68","999999=+Form21!C69","999999=+Form21!E69","999999=+Form21!C70","999999=+Form21!C71","999999=+Form21!C72","999999=+Form21!C73","999999=+Form21!E73","999999=+Form21!C78","999999=+Form21!C79","999999=+Form21!C80","999999=+Form21!D78","999999=+Form21!D79","999999=+Form21!D80","999999=+Form21!E78","999999=+Form21!E79","999999=+Form21!E80","999999=+Form21!C82","999999=+Form21!C95","999999=+Form21!D95","999999=+Form21!C96","999999=+Form21!D96","999999=+Form21!C97","999999=+Form21!D97","999999=+Form21!D98","999999=+Form21!D99",0,"999999=+Form21!D100","999999=+Form21!E95","999999=+Form21!F95","999999=+Form21!E96","999999=+Form21!F96","999999=+Form21!E97","999999=+Form21!F97","999999=+Form21!F98","999999=+Form21!F99",0,"999999=+Form21!F100","999999=+Form21!G95","999999=+Form21!H95","999999=+Form21!G96","999999=+Form21!H96","999999=+Form21!G97","999999=+Form21!H97","999999=+Form21!H98","999999=+Form21!H99",0,"999999=+Form21!H100","999999=+Form21!C105","999999=+Form21!D105","999999=+Form21!C106","999999=+Form21!D106","999999=+Form21!C107","999999=+Form21!D107","999999=+Form21!D108","999999=+Form21!D109",0,"999999=+Form21!D110","999999=+Form21!E105","999999=+Form21!F105","999999=+Form21!E106","999999=+Form21!F106","999999=+Form21!E107","999999=+Form21!F107","999999=+Form21!F108","999999=+Form21!F109",0,"999999=+Form21!F110","999999=+Form21!G105","999999=+Form21!H105","999999=+Form21!G106","999999=+Form21!H106","999999=+Form21!G107","999999=+Form21!H107","999999=+Form21!H108","999999=+Form21!H109",0,"999999=+Form21!H110","999999=+Form21!J105","999999=+Form21!J106","999999=+Form21!C123",null,"999999=+Form21!D123","999999=+Form21!C124","999999=+Form21!C125","999999=+Form21!C126","999999=+Form21!C127","999999=+Form21!C129","Non-Divested"]
[22,"999999=+MID(CELL(\"filename\",A1),FIND(\"[\",CELL(\"filename\",A1))+1,FIND(\"]\", CELL(\"filename\",A1))-FIND(\"[\",CELL(\"filename\",A1))-1)",null,null,"999999=+Form22!E5",22,"999999=+Form22!C7",null,"999999=+Form22!C8","999999=+Form22!C9","999999=+Form22!C10","999999=+Form22!C11","999999=+Form22!E11","999999=+Form22!F11","999999=+Form22!C12","999999=+Form22!C16","999999=+Form22!C17","999999=+Form22!E17","999999=+Form22!F17","999999=+Form22!C18","999999=+Form22!F18","999999=+Form22!C19","999999=+Form22!C20","999999=+Form22!E20","999999=+Form22!C24","999999=+Form22!C25","999999=+Form22!C26","999999=+Form22!F26","999999=+Form22!C27","999999=+Form22!C28","999999=+Form22!E28","999999=+Form22!F28","999999=+Form22!C29","999999=+Form22!C30","999999=+Form22!C31","999999=+Form22!C32","999999=+Form22!C33","999999=+Form22!C37",null,"999999=+Form22!C38",null,"999999=+Form22!C39",null,"999999=+Form22!C40",null,"999999=+Form22!C41","999999=+Form22!C47","999999=+Form22!C48","999999=+Form22!C49","999999=+Form22!C50","999999=+Form22!C51","999999=+Form22!C52","999999=+Form22!C53","999999=+Form22!C54","999999=+Form22!C55","999999=+Form22!C56","999999=+Form22!C57","999999=+Form22!C58","999999=+Form22!D47","999999=+Form22!D48","999999=+Form22!D49","999999=+Form22!D50","999999=+Form22!D51","999999=+Form22!D52","999999=+Form22!D53","999999=+Form22!D54","999999=+Form22!D55","999999=+Form22!D56","999999=+Form22!D57","999999=+Form22!D58","999999=+Form22!E47","999999=+Form22!E48","999999=+Form22!E49","999999=+Form22!E50","999999=+Form22!E51","999999=+Form22!E52","999999=+Form22!E53","999999=+Form22!E54","999999=+Form22!E55","999999=+Form22!E56","999999=+Form22!E57","999999=+Form22!E58","999999=+Form22!$C$60","999999=+Form22!C64","999999=+Form22!C65",null,"999999=+Form22!C66","999999=+Form22!C67","999999=+Form22!$E$67","999999=+Form22!C68","999999=+Form22!C69","999999=+Form22!E69","999999=+Form22!C70","999999=+Form22!C71","999999=+Form22!C72","999999=+Form22!C73","999999=+Form22!E73","999999=+Form22!C78","999999=+Form22!C79","999999=+Form22!C80","999999=+Form22!D78","999999=+Form22!D79","999999=+Form22!D80","999999=+Form22!E78","999999=+Form22!E79","999999=+Form22!E80","999999=+Form22!C82","999999=+Form22!C95","999999=+Form22!D95","999999=+Form22!C96","999999=+Form22!D96","999999=+Form22!C97","999999=+Form22!D97","999999=+Form22!D98","999999=+Form22!D99",0,"999999=+Form22!D100","999999=+Form22!E95","999999=+Form22!F95","999999=+Form22!E96","999999=+Form22!F96","999999=+Form22!E97","999999=+Form22!F97","999999=+Form22!F98","999999=+Form22!F99",0,"999999=+Form22!F100","999999=+Form22!G95","999999=+Form22!H95","999999=+Form22!G96","999999=+Form22!H96","999999=+Form22!G97","999999=+Form22!H97","999999=+Form22!H98","999999=+Form22!H99",0,"999999=+Form22!H100","999999=+Form22!C105","999999=+Form22!D105","999999=+Form22!C106","999999=+Form22!D106","999999=+Form22!C107","999999=+Form22!D107","999999=+Form22!D108","999999=+Form22!D109",0,"999999=+Form22!D110","999999=+Form22!E105","999999=+Form22!F105","999999=+Form22!E106","999999=+Form22!F106","999999=+Form22!E107","999999=+Form22!F107","999999=+Form22!F108","999999=+Form22!F109",0,"999999=+Form22!F110","999999=+Form22!G105","999999=+Form22!H105","999999=+Form22!G106","999999=+Form22!H106","999999=+Form22!G107","999999=+Form22!H107","999999=+Form22!H108","999999=+Form22!H109",0,"999999=+Form22!H110","999999=+Form22!J105","999999=+Form22!J106","999999=+Form22!C123",null,"999999=+Form22!D123","999999=+Form22!C124","999999=+Form22!C125","999999=+Form22!C126","999999=+Form22!C127","999999=+Form22!C129","Non-Divested"]
[23,"999999=+MID(CELL(\"filename\",A1),FIND(\"[\",CELL(\"filename\",A1))+1,FIND(\"]\", CELL(\"filename\",A1))-FIND(\"[\",CELL(\"filename\",A1))-1)",null,null,"999999=+Form23!E5",23,"999999=+Form23!C7",null,"999999=+Form23!C8","999999=+Form23!C9","999999=+Form23!C10","999999=+Form23!C11","999999=+Form23!E11","999999=+Form23!F11","999999=+Form23!C12","999999=+Form23!C16","999999=+Form23!C17","999999=+Form23!E17","999999=+Form23!F17","999999=+Form23!C18","999999=+Form23!F18","999999=+Form23!C19","999999=+Form23!C20","999999=+Form23!E20","999999=+Form23!C24","999999=+Form23!C25","999999=+Form23!C26","999999=+Form23!F26","999999=+Form23!C27","999999=+Form23!C28","999999=+Form23!E28","999999=+Form23!F28","999999=+Form23!C29","999999=+Form23!C30","999999=+Form23!C31","999999=+Form23!C32","999999=+Form23!C33","999999=+Form23!C37",null,"999999=+Form23!C38",null,"999999=+Form23!C39",null,"999999=+Form23!C40",null,"999999=+Form23!C41","999999=+Form23!C47","999999=+Form23!C48","999999=+Form23!C49","999999=+Form23!C50","999999=+Form23!C51","999999=+Form23!C52","999999=+Form23!C53","999999=+Form23!C54","999999=+Form23!C55","999999=+Form23!C56","999999=+Form23!C57","999999=+Form23!C58","999999=+Form23!D47","999999=+Form23!D48","999999=+Form23!D49","999999=+Form23!D50","999999=+Form23!D51","999999=+Form23!D52","999999=+Form23!D53","999999=+Form23!D54","999999=+Form23!D55","999999=+Form23!D56","999999=+Form23!D57","999999=+Form23!D58","999999=+Form23!E47","999999=+Form23!E48","999999=+Form23!E49","999999=+Form23!E50","999999=+Form23!E51","999999=+Form23!E52","999999=+Form23!E53","999999=+Form23!E54","999999=+Form23!E55","999999=+Form23!E56","999999=+Form23!E57","999999=+Form23!E58","999999=+Form23!$C$60","999999=+Form23!C64","999999=+Form23!C65",null,"999999=+Form23!C66","999999=+Form23!C67","999999=+Form23!$E$67","999999=+Form23!C68","999999=+Form23!C69","999999=+Form23!E69","999999=+Form23!C70","999999=+Form23!C71","999999=+Form23!C72","999999=+Form23!C73","999999=+Form23!E73","999999=+Form23!C78","999999=+Form23!C79","999999=+Form23!C80","999999=+Form23!D78","999999=+Form23!D79","999999=+Form23!D80","999999=+Form23!E78","999999=+Form23!E79","999999=+Form23!E80","999999=+Form23!C82","999999=+Form23!C95","999999=+Form23!D95","999999=+Form23!C96","999999=+Form23!D96","999999=+Form23!C97","999999=+Form23!D97","999999=+Form23!D98","999999=+Form23!D99",0,"999999=+Form23!D100","999999=+Form23!E95","999999=+Form23!F95","999999=+Form23!E96","999999=+Form23!F96","999999=+Form23!E97","999999=+Form23!F97","999999=+Form23!F98","999999=+Form23!F99",0,"999999=+Form23!F100","999999=+Form23!G95","999999=+Form23!H95","999999=+Form23!G96","999999=+Form23!H96","999999=+Form23!G97","999999=+Form23!H97","999999=+Form23!H98","999999=+Form23!H99",0,"999999=+Form23!H100","999999=+Form23!C105","999999=+Form23!D105","999999=+Form23!C106","999999=+Form23!D106","999999=+Form23!C107","999999=+Form23!D107","999999=+Form23!D108","999999=+Form23!D109",0,"999999=+Form23!D110","999999=+Form23!E105","999999=+Form23!F105","999999=+Form23!E106","999999=+Form23!F106","999999=+Form23!E107","999999=+Form23!F107","999999=+Form23!F108","999999=+Form23!F109",0,"999999=+Form23!F110","999999=+Form23!G105","999999=+Form23!H105","999999=+Form23!G106","999999=+Form23!H106","999999=+Form23!G107","999999=+Form23!H107","999999=+Form23!H108","999999=+Form23!H109",0,"999999=+Form23!H110","999999=+Form23!J105","999999=+Form23!J106","999999=+Form23!C123",null,"999999=+Form23!D123","999999=+Form23!C124","999999=+Form23!C125","999999=+Form23!C126","999999=+Form23!C127","999999=+Form23!C129","Non-Divested"]
[24,"999999=+MID(CELL(\"filename\",A1),FIND(\"[\",CELL(\"filename\",A1))+1,FIND(\"]\", CELL(\"filename\",A1))-FIND(\"[\",CELL(\"filename\",A1))-1)",null,null,"999999=+Form24!E5",24,"999999=+Form24!C7",null,"999999=+Form24!C8","999999=+Form24!C9","999999=+Form24!C10","999999=+Form24!C11","999999=+Form24!E11","999999=+Form24!F11","999999=+Form24!C12","999999=+Form24!C16","999999=+Form24!C17","999999=+Form24!E17","999999=+Form24!F17","999999=+Form24!C18","999999=+Form24!F18","999999=+Form24!C19","999999=+Form24!C20","999999=+Form24!E20","999999=+Form24!C24","999999=+Form24!C25","999999=+Form24!C26","999999=+Form24!F26","999999=+Form24!C27","999999=+Form24!C28","999999=+Form24!E28","999999=+Form24!F28","999999=+Form24!C29","999999=+Form24!C30","999999=+Form24!C31","999999=+Form24!C32","999999=+Form24!C33","999999=+Form24!C37",null,"999999=+Form24!C38",null,"999999=+Form24!C39",null,"999999=+Form24!C40",null,"999999=+Form24!C41","999999=+Form24!C47","999999=+Form24!C48","999999=+Form24!C49","999999=+Form24!C50","999999=+Form24!C51","999999=+Form24!C52","999999=+Form24!C53","999999=+Form24!C54","999999=+Form24!C55","999999=+Form24!C56","999999=+Form24!C57","999999=+Form24!C58","999999=+Form24!D47","999999=+Form24!D48","999999=+Form24!D49","999999=+Form24!D50","999999=+Form24!D51","999999=+Form24!D52","999999=+Form24!D53","999999=+Form24!D54","999999=+Form24!D55","999999=+Form24!D56","999999=+Form24!D57","999999=+Form24!D58","999999=+Form24!E47","999999=+Form24!E48","999999=+Form24!E49","999999=+Form24!E50","999999=+Form24!E51","999999=+Form24!E52","999999=+Form24!E53","999999=+Form24!E54","999999=+Form24!E55","999999=+Form24!E56","999999=+Form24!E57","999999=+Form24!E58","999999=+Form24!$C$60","999999=+Form24!C64","999999=+Form24!C65",null,"999999=+Form24!C66","999999=+Form24!C67","999999=+Form24!$E$67","999999=+Form24!C68","999999=+Form24!C69","999999=+Form24!E69","999999=+Form24!C70","999999=+Form24!C71","999999=+Form24!C72","999999=+Form24!C73","999999=+Form24!E73","999999=+Form24!C78","999999=+Form24!C79","999999=+Form24!C80","999999=+Form24!D78","999999=+Form24!D79","999999=+Form24!D80","999999=+Form24!E78","999999=+Form24!E79","999999=+Form24!E80","999999=+Form24!C82","999999=+Form24!C95","999999=+Form24!D95","999999=+Form24!C96","999999=+Form24!D96","999999=+Form24!C97","999999=+Form24!D97","999999=+Form24!D98","999999=+Form24!D99",0,"999999=+Form24!D100","999999=+Form24!E95","999999=+Form24!F95","999999=+Form24!E96","999999=+Form24!F96","999999=+Form24!E97","999999=+Form24!F97","999999=+Form24!F98","999999=+Form24!F99",0,"999999=+Form24!F100","999999=+Form24!G95","999999=+Form24!H95","999999=+Form24!G96","999999=+Form24!H96","999999=+Form24!G97","999999=+Form24!H97","999999=+Form24!H98","999999=+Form24!H99",0,"999999=+Form24!H100","999999=+Form24!C105","999999=+Form24!D105","999999=+Form24!C106","999999=+Form24!D106","999999=+Form24!C107","999999=+Form24!D107","999999=+Form24!D108","999999=+Form24!D109",0,"999999=+Form24!D110","999999=+Form24!E105","999999=+Form24!F105","999999=+Form24!E106","999999=+Form24!F106","999999=+Form24!E107","999999=+Form24!F107","999999=+Form24!F108","999999=+Form24!F109",0,"999999=+Form24!F110","999999=+Form24!G105","999999=+Form24!H105","999999=+Form24!G106","999999=+Form24!H106","999999=+Form24!G107","999999=+Form24!H107","999999=+Form24!H108","999999=+Form24!H109",0,"999999=+Form24!H110","999999=+Form24!J105","999999=+Form24!J106","999999=+Form24!C123",null,"999999=+Form24!D123","999999=+Form24!C124","999999=+Form24!C125","999999=+Form24!C126","999999=+Form24!C127","999999=+Form24!C129","Non-Divested"]
[25,"999999=+MID(CELL(\"filename\",A1),FIND(\"[\",CELL(\"filename\",A1))+1,FIND(\"]\", CELL(\"filename\",A1))-FIND(\"[\",CELL(\"filename\",A1))-1)",null,null,"999999=+Form25!E5",25,"999999=+Form25!C7",null,"999999=+Form25!C8","999999=+Form25!C9","999999=+Form25!C10","999999=+Form25!C11","999999=+Form25!E11","999999=+Form25!F11","999999=+Form25!C12","999999=+Form25!C16","999999=+Form25!C17","999999=+Form25!E17","999999=+Form25!F17","999999=+Form25!C18","999999=+Form25!F18","999999=+Form25!C19","999999=+Form25!C20","999999=+Form25!E20","999999=+Form25!C24","999999=+Form25!C25","999999=+Form25!C26","999999=+Form25!F26","999999=+Form25!C27","999999=+Form25!C28","999999=+Form25!E28","999999=+Form25!F28","999999=+Form25!C29","999999=+Form25!C30","999999=+Form25!C31","999999=+Form25!C32","999999=+Form25!C33","999999=+Form25!C37",null,"999999=+Form25!C38",null,"999999=+Form25!C39",null,"999999=+Form25!C40",null,"999999=+Form25!C41","999999=+Form25!C47","999999=+Form25!C48","999999=+Form25!C49","999999=+Form25!C50","999999=+Form25!C51","999999=+Form25!C52","999999=+Form25!C53","999999=+Form25!C54","999999=+Form25!C55","999999=+Form25!C56","999999=+Form25!C57","999999=+Form25!C58","999999=+Form25!D47","999999=+Form25!D48","999999=+Form25!D49","999999=+Form25!D50","999999=+Form25!D51","999999=+Form25!D52","999999=+Form25!D53","999999=+Form25!D54","999999=+Form25!D55","999999=+Form25!D56","999999=+Form25!D57","999999=+Form25!D58","999999=+Form25!E47","999999=+Form25!E48","999999=+Form25!E49","999999=+Form25!E50","999999=+Form25!E51","999999=+Form25!E52","999999=+Form25!E53","999999=+Form25!E54","999999=+Form25!E55","999999=+Form25!E56","999999=+Form25!E57","999999=+Form25!E58","999999=+Form25!$C$60","999999=+Form25!C64","999999=+Form25!C65",null,"999999=+Form25!C66","999999=+Form25!C67","999999=+Form25!$E$67","999999=+Form25!C68","999999=+Form25!C69","999999=+Form25!E69","999999=+Form25!C70","999999=+Form25!C71","999999=+Form25!C72","999999=+Form25!C73","999999=+Form25!E73","999999=+Form25!C78","999999=+Form25!C79","999999=+Form25!C80","999999=+Form25!D78","999999=+Form25!D79","999999=+Form25!D80","999999=+Form25!E78","999999=+Form25!E79","999999=+Form25!E80","999999=+Form25!C82","999999=+Form25!C95","999999=+Form25!D95","999999=+Form25!C96","999999=+Form25!D96","999999=+Form25!C97","999999=+Form25!D97","999999=+Form25!D98","999999=+Form25!D99",0,"999999=+Form25!D100","999999=+Form25!E95","999999=+Form25!F95","999999=+Form25!E96","999999=+Form25!F96","999999=+Form25!E97","999999=+Form25!F97","999999=+Form25!F98","999999=+Form25!F99",0,"999999=+Form25!F100","999999=+Form25!G95","999999=+Form25!H95","999999=+Form25!G96","999999=+Form25!H96","999999=+Form25!G97","999999=+Form25!H97","999999=+Form25!H98","999999=+Form25!H99",0,"999999=+Form25!H100","999999=+Form25!C105","999999=+Form25!D105","999999=+Form25!C106","999999=+Form25!D106","999999=+Form25!C107","999999=+Form25!D107","999999=+Form25!D108","999999=+Form25!D109",0,"999999=+Form25!D110","999999=+Form25!E105","999999=+Form25!F105","999999=+Form25!E106","999999=+Form25!F106","999999=+Form25!E107","999999=+Form25!F107","999999=+Form25!F108","999999=+Form25!F109",0,"999999=+Form25!F110","999999=+Form25!G105","999999=+Form25!H105","999999=+Form25!G106","999999=+Form25!H106","999999=+Form25!G107","999999=+Form25!H107","999999=+Form25!H108","999999=+Form25!H109",0,"999999=+Form25!H110","999999=+Form25!J105","999999=+Form25!J106","999999=+Form25!C123",null,"999999=+Form25!D123","999999=+Form25!C124","999999=+Form25!C125","999999=+Form25!C126","999999=+Form25!C127","999999=+Form25!C129","Non-Divested"]
[26,"999999=+MID(CELL(\"filename\",A1),FIND(\"[\",CELL(\"filename\",A1))+1,FIND(\"]\", CELL(\"filename\",A1))-FIND(\"[\",CELL(\"filename\",A1))-1)",null,null,"999999=+Form26!E5",26,"999999=+Form26!C7",null,"999999=+Form26!C8","999999=+Form26!C9","999999=+Form26!C10","999999=+Form26!C11","999999=+Form26!E11","999999=+Form26!F11","999999=+Form26!C12","999999=+Form26!C16","999999=+Form26!C17","999999=+Form26!E17","999999=+Form26!F17","999999=+Form26!C18","999999=+Form26!F18","999999=+Form26!C19","999999=+Form26!C20","999999=+Form26!E20","999999=+Form26!C24","999999=+Form26!C25","999999=+Form26!C26","999999=+Form26!F26","999999=+Form26!C27","999999=+Form26!C28","999999=+Form26!E28","999999=+Form26!F28","999999=+Form26!C29","999999=+Form26!C30","999999=+Form26!C31","999999=+Form26!C32","999999=+Form26!C33","999999=+Form26!C37",null,"999999=+Form26!C38",null,"999999=+Form26!C39",null,"999999=+Form26!C40",null,"999999=+Form26!C41","999999=+Form26!C47","999999=+Form26!C48","999999=+Form26!C49","999999=+Form26!C50","999999=+Form26!C51","999999=+Form26!C52","999999=+Form26!C53","999999=+Form26!C54","999999=+Form26!C55","999999=+Form26!C56","999999=+Form26!C57","999999=+Form26!C58","999999=+Form26!D47","999999=+Form26!D48","999999=+Form26!D49","999999=+Form26!D50","999999=+Form26!D51","999999=+Form26!D52","999999=+Form26!D53","999999=+Form26!D54","999999=+Form26!D55","999999=+Form26!D56","999999=+Form26!D57","999999=+Form26!D58","999999=+Form26!E47","999999=+Form26!E48","999999=+Form26!E49","999999=+Form26!E50","999999=+Form26!E51","999999=+Form26!E52","999999=+Form26!E53","999999=+Form26!E54","999999=+Form26!E55","999999=+Form26!E56","999999=+Form26!E57","999999=+Form26!E58","999999=+Form26!$C$60","999999=+Form26!C64","999999=+Form26!C65",null,"999999=+Form26!C66","999999=+Form26!C67","999999=+Form26!$E$67","999999=+Form26!C68","999999=+Form26!C69","999999=+Form26!E69","999999=+Form26!C70","999999=+Form26!C71","999999=+Form26!C72","999999=+Form26!C73","999999=+Form26!E73","999999=+Form26!C78","999999=+Form26!C79","999999=+Form26!C80","999999=+Form26!D78","999999=+Form26!D79","999999=+Form26!D80","999999=+Form26!E78","999999=+Form26!E79","999999=+Form26!E80","999999=+Form26!C82","999999=+Form26!C95","999999=+Form26!D95","999999=+Form26!C96","999999=+Form26!D96","999999=+Form26!C97","999999=+Form26!D97","999999=+Form26!D98","999999=+Form26!D99",0,"999999=+Form26!D100","999999=+Form26!E95","999999=+Form26!F95","999999=+Form26!E96","999999=+Form26!F96","999999=+Form26!E97","999999=+Form26!F97","999999=+Form26!F98","999999=+Form26!F99",0,"999999=+Form26!F100","999999=+Form26!G95","999999=+Form26!H95","999999=+Form26!G96","999999=+Form26!H96","999999=+Form26!G97","999999=+Form26!H97","999999=+Form26!H98","999999=+Form26!H99",0,"999999=+Form26!H100","999999=+Form26!C105","999999=+Form26!D105","999999=+Form26!C106","999999=+Form26!D106","999999=+Form26!C107","999999=+Form26!D107","999999=+Form26!D108","999999=+Form26!D109",0,"999999=+Form26!D110","999999=+Form26!E105","999999=+Form26!F105","999999=+Form26!E106","999999=+Form26!F106","999999=+Form26!E107","999999=+Form26!F107","999999=+Form26!F108","999999=+Form26!F109",0,"999999=+Form26!F110","999999=+Form26!G105","999999=+Form26!H105","999999=+Form26!G106","999999=+Form26!H106","999999=+Form26!G107","999999=+Form26!H107","999999=+Form26!H108","999999=+Form26!H109",0,"999999=+Form26!H110","999999=+Form26!J105","999999=+Form26!J106","999999=+Form26!C123",null,"999999=+Form26!D123","999999=+Form26!C124","999999=+Form26!C125","999999=+Form26!C126","999999=+Form26!C127","999999=+Form26!C129","Non-Divested"]
[27,"999999=+MID(CELL(\"filename\",A1),FIND(\"[\",CELL(\"filename\",A1))+1,FIND(\"]\", CELL(\"filename\",A1))-FIND(\"[\",CELL(\"filename\",A1))-1)",null,null,"999999=+Form27!E5",27,"999999=+Form27!C7",null,"999999=+Form27!C8","999999=+Form27!C9","999999=+Form27!C10","999999=+Form27!C11","999999=+Form27!E11","999999=+Form27!F11","999999=+Form27!C12","999999=+Form27!C16","999999=+Form27!C17","999999=+Form27!E17","999999=+Form27!F17","999999=+Form27!C18","999999=+Form27!F18","999999=+Form27!C19","999999=+Form27!C20","999999=+Form27!E20","999999=+Form27!C24","999999=+Form27!C25","999999=+Form27!C26","999999=+Form27!F26","999999=+Form27!C27","999999=+Form27!C28","999999=+Form27!E28","999999=+Form27!F28","999999=+Form27!C29","999999=+Form27!C30","999999=+Form27!C31","999999=+Form27!C32","999999=+Form27!C33","999999=+Form27!C37",null,"999999=+Form27!C38",null,"999999=+Form27!C39",null,"999999=+Form27!C40",null,"999999=+Form27!C41","999999=+Form27!C47","999999=+Form27!C48","999999=+Form27!C49","999999=+Form27!C50","999999=+Form27!C51","999999=+Form27!C52","999999=+Form27!C53","999999=+Form27!C54","999999=+Form27!C55","999999=+Form27!C56","999999=+Form27!C57","999999=+Form27!C58","999999=+Form27!D47","999999=+Form27!D48","999999=+Form27!D49","999999=+Form27!D50","999999=+Form27!D51","999999=+Form27!D52","999999=+Form27!D53","999999=+Form27!D54","999999=+Form27!D55","999999=+Form27!D56","999999=+Form27!D57","999999=+Form27!D58","999999=+Form27!E47","999999=+Form27!E48","999999=+Form27!E49","999999=+Form27!E50","999999=+Form27!E51","999999=+Form27!E52","999999=+Form27!E53","999999=+Form27!E54","999999=+Form27!E55","999999=+Form27!E56","999999=+Form27!E57","999999=+Form27!E58","999999=+Form27!$C$60","999999=+Form27!C64","999999=+Form27!C65",null,"999999=+Form27!C66","999999=+Form27!C67","999999=+Form27!$E$67","999999=+Form27!C68","999999=+Form27!C69","999999=+Form27!E69","999999=+Form27!C70","999999=+Form27!C71","999999=+Form27!C72","999999=+Form27!C73","999999=+Form27!E73","999999=+Form27!C78","999999=+Form27!C79","999999=+Form27!C80","999999=+Form27!D78","999999=+Form27!D79","999999=+Form27!D80","999999=+Form27!E78","999999=+Form27!E79","999999=+Form27!E80","999999=+Form27!C82","999999=+Form27!C95","999999=+Form27!D95","999999=+Form27!C96","999999=+Form27!D96","999999=+Form27!C97","999999=+Form27!D97","999999=+Form27!D98","999999=+Form27!D99",0,"999999=+Form27!D100","999999=+Form27!E95","999999=+Form27!F95","999999=+Form27!E96","999999=+Form27!F96","999999=+Form27!E97","999999=+Form27!F97","999999=+Form27!F98","999999=+Form27!F99",0,"999999=+Form27!F100","999999=+Form27!G95","999999=+Form27!H95","999999=+Form27!G96","999999=+Form27!H96","999999=+Form27!G97","999999=+Form27!H97","999999=+Form27!H98","999999=+Form27!H99",0,"999999=+Form27!H100","999999=+Form27!C105","999999=+Form27!D105","999999=+Form27!C106","999999=+Form27!D106","999999=+Form27!C107","999999=+Form27!D107","999999=+Form27!D108","999999=+Form27!D109",0,"999999=+Form27!D110","999999=+Form27!E105","999999=+Form27!F105","999999=+Form27!E106","999999=+Form27!F106","999999=+Form27!E107","999999=+Form27!F107","999999=+Form27!F108","999999=+Form27!F109",0,"999999=+Form27!F110","999999=+Form27!G105","999999=+Form27!H105","999999=+Form27!G106","999999=+Form27!H106","999999=+Form27!G107","999999=+Form27!H107","999999=+Form27!H108","999999=+Form27!H109",0,"999999=+Form27!H110","999999=+Form27!J105","999999=+Form27!J106","999999=+Form27!C123",null,"999999=+Form27!D123","999999=+Form27!C124","999999=+Form27!C125","999999=+Form27!C126","999999=+Form27!C127","999999=+Form27!C129","Non-Divested"]
[28,"999999=+MID(CELL(\"filename\",A1),FIND(\"[\",CELL(\"filename\",A1))+1,FIND(\"]\", CELL(\"filename\",A1))-FIND(\"[\",CELL(\"filename\",A1))-1)",null,null,"999999=+Form28!E5",28,"999999=+Form28!C7",null,"999999=+Form28!C8","999999=+Form28!C9","999999=+Form28!C10","999999=+Form28!C11","999999=+Form28!E11","999999=+Form28!F11","999999=+Form28!C12","999999=+Form28!C16","999999=+Form28!C17","999999=+Form28!E17","999999=+Form28!F17","999999=+Form28!C18","999999=+Form28!F18","999999=+Form28!C19","999999=+Form28!C20","999999=+Form28!E20","999999=+Form28!C24","999999=+Form28!C25","999999=+Form28!C26","999999=+Form28!F26","999999=+Form28!C27","999999=+Form28!C28","999999=+Form28!E28","999999=+Form28!F28","999999=+Form28!C29","999999=+Form28!C30","999999=+Form28!C31","999999=+Form28!C32","999999=+Form28!C33","999999=+Form28!C37",null,"999999=+Form28!C38",null,"999999=+Form28!C39",null,"999999=+Form28!C40",null,"999999=+Form28!C41","999999=+Form28!C47","999999=+Form28!C48","999999=+Form28!C49","999999=+Form28!C50","999999=+Form28!C51","999999=+Form28!C52","999999=+Form28!C53","999999=+Form28!C54","999999=+Form28!C55","999999=+Form28!C56","999999=+Form28!C57","999999=+Form28!C58","999999=+Form28!D47","999999=+Form28!D48","999999=+Form28!D49","999999=+Form28!D50","999999=+Form28!D51","999999=+Form28!D52","999999=+Form28!D53","999999=+Form28!D54","999999=+Form28!D55","999999=+Form28!D56","999999=+Form28!D57","999999=+Form28!D58","999999=+Form28!E47","999999=+Form28!E48","999999=+Form28!E49","999999=+Form28!E50","999999=+Form28!E51","999999=+Form28!E52","999999=+Form28!E53","999999=+Form28!E54","999999=+Form28!E55","999999=+Form28!E56","999999=+Form28!E57","999999=+Form28!E58","999999=+Form28!$C$60","999999=+Form28!C64","999999=+Form28!C65",null,"999999=+Form28!C66","999999=+Form28!C67","999999=+Form28!$E$67","999999=+Form28!C68","999999=+Form28!C69","999999=+Form28!E69","999999=+Form28!C70","999999=+Form28!C71","999999=+Form28!C72","999999=+Form28!C73","999999=+Form28!E73","999999=+Form28!C78","999999=+Form28!C79","999999=+Form28!C80","999999=+Form28!D78","999999=+Form28!D79","999999=+Form28!D80","999999=+Form28!E78","999999=+Form28!E79","999999=+Form28!E80","999999=+Form28!C82","999999=+Form28!C95","999999=+Form28!D95","999999=+Form28!C96","999999=+Form28!D96","999999=+Form28!C97","999999=+Form28!D97","999999=+Form28!D98","999999=+Form28!D99",0,"999999=+Form28!D100","999999=+Form28!E95","999999=+Form28!F95","999999=+Form28!E96","999999=+Form28!F96","999999=+Form28!E97","999999=+Form28!F97","999999=+Form28!F98","999999=+Form28!F99",0,"999999=+Form28!F100","999999=+Form28!G95","999999=+Form28!H95","999999=+Form28!G96","999999=+Form28!H96","999999=+Form28!G97","999999=+Form28!H97","999999=+Form28!H98","999999=+Form28!H99",0,"999999=+Form28!H100","999999=+Form28!C105","999999=+Form28!D105","999999=+Form28!C106","999999=+Form28!D106","999999=+Form28!C107","999999=+Form28!D107","999999=+Form28!D108","999999=+Form28!D109",0,"999999=+Form28!D110","999999=+Form28!E105","999999=+Form28!F105","999999=+Form28!E106","999999=+Form28!F106","999999=+Form28!E107","999999=+Form28!F107","999999=+Form28!F108","999999=+Form28!F109",0,"999999=+Form28!F110","999999=+Form28!G105","999999=+Form28!H105","999999=+Form28!G106","999999=+Form28!H106","999999=+Form28!G107","999999=+Form28!H107","999999=+Form28!H108","999999=+Form28!H109",0,"999999=+Form28!H110","999999=+Form28!J105","999999=+Form28!J106","999999=+Form28!C123",null,"999999=+Form28!D123","999999=+Form28!C124","999999=+Form28!C125","999999=+Form28!C126","999999=+Form28!C127","999999=+Form28!C129","Non-Divested"]
[29,"999999=+MID(CELL(\"filename\",A1),FIND(\"[\",CELL(\"filename\",A1))+1,FIND(\"]\", CELL(\"filename\",A1))-FIND(\"[\",CELL(\"filename\",A1))-1)",null,null,"999999=+Form29!E5",29,"999999=+Form29!C7",null,"999999=+Form29!C8","999999=+Form29!C9","999999=+Form29!C10","999999=+Form29!C11","999999=+Form29!E11","999999=+Form29!F11","999999=+Form29!C12","999999=+Form29!C16","999999=+Form29!C17","999999=+Form29!E17","999999=+Form29!F17","999999=+Form29!C18","999999=+Form29!F18","999999=+Form29!C19","999999=+Form29!C20","999999=+Form29!E20","999999=+Form29!C24","999999=+Form29!C25","999999=+Form29!C26","999999=+Form29!F26","999999=+Form29!C27","999999=+Form29!C28","999999=+Form29!E28","999999=+Form29!F28","999999=+Form29!C29","999999=+Form29!C30","999999=+Form29!C31","999999=+Form29!C32","999999=+Form29!C33","999999=+Form29!C37",null,"999999=+Form29!C38",null,"999999=+Form29!C39",null,"999999=+Form29!C40",null,"999999=+Form29!C41","999999=+Form29!C47","999999=+Form29!C48","999999=+Form29!C49","999999=+Form29!C50","999999=+Form29!C51","999999=+Form29!C52","999999=+Form29!C53","999999=+Form29!C54","999999=+Form29!C55","999999=+Form29!C56","999999=+Form29!C57","999999=+Form29!C58","999999=+Form29!D47","999999=+Form29!D48","999999=+Form29!D49","999999=+Form29!D50","999999=+Form29!D51","999999=+Form29!D52","999999=+Form29!D53","999999=+Form29!D54","999999=+Form29!D55","999999=+Form29!D56","999999=+Form29!D57","999999=+Form29!D58","999999=+Form29!E47","999999=+Form29!E48","999999=+Form29!E49","999999=+Form29!E50","999999=+Form29!E51","999999=+Form29!E52","999999=+Form29!E53","999999=+Form29!E54","999999=+Form29!E55","999999=+Form29!E56","999999=+Form29!E57","999999=+Form29!E58","999999=+Form29!$C$60","999999=+Form29!C64","999999=+Form29!C65",null,"999999=+Form29!C66","999999=+Form29!C67","999999=+Form29!$E$67","999999=+Form29!C68","999999=+Form29!C69","999999=+Form29!E69","999999=+Form29!C70","999999=+Form29!C71","999999=+Form29!C72","999999=+Form29!C73","999999=+Form29!E73","999999=+Form29!C78","999999=+Form29!C79","999999=+Form29!C80","999999=+Form29!D78","999999=+Form29!D79","999999=+Form29!D80","999999=+Form29!E78","999999=+Form29!E79","999999=+Form29!E80","999999=+Form29!C82","999999=+Form29!C95","999999=+Form29!D95","999999=+Form29!C96","999999=+Form29!D96","999999=+Form29!C97","999999=+Form29!D97","999999=+Form29!D98","999999=+Form29!D99",0,"999999=+Form29!D100","999999=+Form29!E95","999999=+Form29!F95","999999=+Form29!E96","999999=+Form29!F96","999999=+Form29!E97","999999=+Form29!F97","999999=+Form29!F98","999999=+Form29!F99",0,"999999=+Form29!F100","999999=+Form29!G95","999999=+Form29!H95","999999=+Form29!G96","999999=+Form29!H96","999999=+Form29!G97","999999=+Form29!H97","999999=+Form29!H98","999999=+Form29!H99",0,"999999=+Form29!H100","999999=+Form29!C105","999999=+Form29!D105","999999=+Form29!C106","999999=+Form29!D106","999999=+Form29!C107","999999=+Form29!D107","999999=+Form29!D108","999999=+Form29!D109",0,"999999=+Form29!D110","999999=+Form29!E105","999999=+Form29!F105","999999=+Form29!E106","999999=+Form29!F106","999999=+Form29!E107","999999=+Form29!F107","999999=+Form29!F108","999999=+Form29!F109",0,"999999=+Form29!F110","999999=+Form29!G105","999999=+Form29!H105","999999=+Form29!G106","999999=+Form29!H106","999999=+Form29!G107","999999=+Form29!H107","999999=+Form29!H108","999999=+Form29!H109",0,"999999=+Form29!H110","999999=+Form29!J105","999999=+Form29!J106","999999=+Form29!C123",null,"999999=+Form29!D123","999999=+Form29!C124","999999=+Form29!C125","999999=+Form29!C126","999999=+Form29!C127","999999=+Form29!C129","Non-Divested"]
[30,"999999=+MID(CELL(\"filename\",A1),FIND(\"[\",CELL(\"filename\",A1))+1,FIND(\"]\", CELL(\"filename\",A1))-FIND(\"[\",CELL(\"filename\",A1))-1)",null,null,"999999=+Form30!E5",30,"999999=+Form30!C7",null,"999999=+Form30!C8","999999=+Form30!C9","999999=+Form30!C10","999999=+Form30!C11","999999=+Form30!E11","999999=+Form30!F11","999999=+Form30!C12","999999=+Form30!C16","999999=+Form30!C17","999999=+Form30!E17","999999=+Form30!F17","999999=+Form30!C18","999999=+Form30!F18","999999=+Form30!C19","999999=+Form30!C20","999999=+Form30!E20","999999=+Form30!C24","999999=+Form30!C25","999999=+Form30!C26","999999=+Form30!F26","999999=+Form30!C27","999999=+Form30!C28","999999=+Form30!E28","999999=+Form30!F28","999999=+Form30!C29","999999=+Form30!C30","999999=+Form30!C31","999999=+Form30!C32","999999=+Form30!C33","999999=+Form30!C37",null,"999999=+Form30!C38",null,"999999=+Form30!C39",null,"999999=+Form30!C40",null,"999999=+Form30!C41","999999=+Form30!C47","999999=+Form30!C48","999999=+Form30!C49","999999=+Form30!C50","999999=+Form30!C51","999999=+Form30!C52","999999=+Form30!C53","999999=+Form30!C54","999999=+Form30!C55","999999=+Form30!C56","999999=+Form30!C57","999999=+Form30!C58","999999=+Form30!D47","999999=+Form30!D48","999999=+Form30!D49","999999=+Form30!D50","999999=+Form30!D51","999999=+Form30!D52","999999=+Form30!D53","999999=+Form30!D54","999999=+Form30!D55","999999=+Form30!D56","999999=+Form30!D57","999999=+Form30!D58","999999=+Form30!E47","999999=+Form30!E48","999999=+Form30!E49","999999=+Form30!E50","999999=+Form30!E51","999999=+Form30!E52","999999=+Form30!E53","999999=+Form30!E54","999999=+Form30!E55","999999=+Form30!E56","999999=+Form30!E57","999999=+Form30!E58","999999=+Form30!$C$60","999999=+Form30!C64","999999=+Form30!C65",null,"999999=+Form30!C66","999999=+Form30!C67","999999=+Form30!$E$67","999999=+Form30!C68","999999=+Form30!C69","999999=+Form30!E69","999999=+Form30!C70","999999=+Form30!C71","999999=+Form30!C72","999999=+Form30!C73","999999=+Form30!E73","999999=+Form30!C78","999999=+Form30!C79","999999=+Form30!C80","999999=+Form30!D78","999999=+Form30!D79","999999=+Form30!D80","999999=+Form30!E78","999999=+Form30!E79","999999=+Form30!E80","999999=+Form30!C82","999999=+Form30!C95","999999=+Form30!D95","999999=+Form30!C96","999999=+Form30!D96","999999=+Form30!C97","999999=+Form30!D97","999999=+Form30!D98","999999=+Form30!D99",0,"999999=+Form30!D100","999999=+Form30!E95","999999=+Form30!F95","999999=+Form30!E96","999999=+Form30!F96","999999=+Form30!E97","999999=+Form30!F97","999999=+Form30!F98","999999=+Form30!F99",0,"999999=+Form30!F100","999999=+Form30!G95","999999=+Form30!H95","999999=+Form30!G96","999999=+Form30!H96","999999=+Form30!G97","999999=+Form30!H97","999999=+Form30!H98","999999=+Form30!H99",0,"999999=+Form30!H100","999999=+Form30!C105","999999=+Form30!D105","999999=+Form30!C106","999999=+Form30!D106","999999=+Form30!C107","999999=+Form30!D107","999999=+Form30!D108","999999=+Form30!D109",0,"999999=+Form30!D110","999999=+Form30!E105","999999=+Form30!F105","999999=+Form30!E106","999999=+Form30!F106","999999=+Form30!E107","999999=+Form30!F107","999999=+Form30!F108","999999=+Form30!F109",0,"999999=+Form30!F110","999999=+Form30!G105","999999=+Form30!H105","999999=+Form30!G106","999999=+Form30!H106","999999=+Form30!G107","999999=+Form30!H107","999999=+Form30!H108","999999=+Form30!H109",0,"999999=+Form30!H110","999999=+Form30!J105","999999=+Form30!J106","999999=+Form30!C123",null,"999999=+Form30!D123","999999=+Form30!C124","999999=+Form30!C125","999999=+Form30!C126","999999=+Form30!C127","999999=+Form30!C129","Non-Divested"]
[31,"999999=+MID(CELL(\"filename\",A1),FIND(\"[\",CELL(\"filename\",A1))+1,FIND(\"]\", CELL(\"filename\",A1))-FIND(\"[\",CELL(\"filename\",A1))-1)",null,null,"999999=+Form31!E5",31,"999999=+Form31!C7",null,"999999=+Form31!C8","999999=+Form31!C9","999999=+Form31!C10","999999=+Form31!C11","999999=+Form31!E11","999999=+Form31!F11","999999=+Form31!C12","999999=+Form31!C16","999999=+Form31!C17","999999=+Form31!E17","999999=+Form31!F17","999999=+Form31!C18","999999=+Form31!F18","999999=+Form31!C19","999999=+Form31!C20","999999=+Form31!E20","999999=+Form31!C24","999999=+Form31!C25","999999=+Form31!C26","999999=+Form31!F26","999999=+Form31!C27","999999=+Form31!C28","999999=+Form31!E28","999999=+Form31!F28","999999=+Form31!C29","999999=+Form31!C30","999999=+Form31!C31","999999=+Form31!C32","999999=+Form31!C33","999999=+Form31!C37",null,"999999=+Form31!C38",null,"999999=+Form31!C39",null,"999999=+Form31!C40",null,"999999=+Form31!C41","999999=+Form31!C47","999999=+Form31!C48","999999=+Form31!C49","999999=+Form31!C50","999999=+Form31!C51","999999=+Form31!C52","999999=+Form31!C53","999999=+Form31!C54","999999=+Form31!C55","999999=+Form31!C56","999999=+Form31!C57","999999=+Form31!C58","999999=+Form31!D47","999999=+Form31!D48","999999=+Form31!D49","999999=+Form31!D50","999999=+Form31!D51","999999=+Form31!D52","999999=+Form31!D53","999999=+Form31!D54","999999=+Form31!D55","999999=+Form31!D56","999999=+Form31!D57","999999=+Form31!D58","999999=+Form31!E47","999999=+Form31!E48","999999=+Form31!E49","999999=+Form31!E50","999999=+Form31!E51","999999=+Form31!E52","999999=+Form31!E53","999999=+Form31!E54","999999=+Form31!E55","999999=+Form31!E56","999999=+Form31!E57","999999=+Form31!E58","999999=+Form31!$C$60","999999=+Form31!C64","999999=+Form31!C65",null,"999999=+Form31!C66","999999=+Form31!C67","999999=+Form31!$E$67","999999=+Form31!C68","999999=+Form31!C69","999999=+Form31!E69","999999=+Form31!C70","999999=+Form31!C71","999999=+Form31!C72","999999=+Form31!C73","999999=+Form31!E73","999999=+Form31!C78","999999=+Form31!C79","999999=+Form31!C80","999999=+Form31!D78","999999=+Form31!D79","999999=+Form31!D80","999999=+Form31!E78","999999=+Form31!E79","999999=+Form31!E80","999999=+Form31!C82","999999=+Form31!C95","999999=+Form31!D95","999999=+Form31!C96","999999=+Form31!D96","999999=+Form31!C97","999999=+Form31!D97","999999=+Form31!D98","999999=+Form31!D99",0,"999999=+Form31!D100","999999=+Form31!E95","999999=+Form31!F95","999999=+Form31!E96","999999=+Form31!F96","999999=+Form31!E97","999999=+Form31!F97","999999=+Form31!F98","999999=+Form31!F99",0,"999999=+Form31!F100","999999=+Form31!G95","999999=+Form31!H95","999999=+Form31!G96","999999=+Form31!H96","999999=+Form31!G97","999999=+Form31!H97","999999=+Form31!H98","999999=+Form31!H99",0,"999999=+Form31!H100","999999=+Form31!C105","999999=+Form31!D105","999999=+Form31!C106","999999=+Form31!D106","999999=+Form31!C107","999999=+Form31!D107","999999=+Form31!D108","999999=+Form31!D109",0,"999999=+Form31!D110","999999=+Form31!E105","999999=+Form31!F105","999999=+Form31!E106","999999=+Form31!F106","999999=+Form31!E107","999999=+Form31!F107","999999=+Form31!F108","999999=+Form31!F109",0,"999999=+Form31!F110","999999=+Form31!G105","999999=+Form31!H105","999999=+Form31!G106","999999=+Form31!H106","999999=+Form31!G107","999999=+Form31!H107","999999=+Form31!H108","999999=+Form31!H109",0,"999999=+Form31!H110","999999=+Form31!J105","999999=+Form31!J106","999999=+Form31!C123",null,"999999=+Form31!D123","999999=+Form31!C124","999999=+Form31!C125","999999=+Form31!C126","999999=+Form31!C127","999999=+Form31!C129","Non-Divested"]
[32,"999999=+MID(CELL(\"filename\",A1),FIND(\"[\",CELL(\"filename\",A1))+1,FIND(\"]\", CELL(\"filename\",A1))-FIND(\"[\",CELL(\"filename\",A1))-1)",null,null,"999999=+Form32!E5",32,"999999=+Form32!C7",null,"999999=+Form32!C8","999999=+Form32!C9","999999=+Form32!C10","999999=+Form32!C11","999999=+Form32!E11","999999=+Form32!F11","999999=+Form32!C12","999999=+Form32!C16","999999=+Form32!C17","999999=+Form32!E17","999999=+Form32!F17","999999=+Form32!C18","999999=+Form32!F18","999999=+Form32!C19","999999=+Form32!C20","999999=+Form32!E20","999999=+Form32!C24","999999=+Form32!C25","999999=+Form32!C26","999999=+Form32!F26","999999=+Form32!C27","999999=+Form32!C28","999999=+Form32!E28","999999=+Form32!F28","999999=+Form32!C29","999999=+Form32!C30","999999=+Form32!C31","999999=+Form32!C32","999999=+Form32!C33","999999=+Form32!C37",null,"999999=+Form32!C38",null,"999999=+Form32!C39",null,"999999=+Form32!C40",null,"999999=+Form32!C41","999999=+Form32!C47","999999=+Form32!C48","999999=+Form32!C49","999999=+Form32!C50","999999=+Form32!C51","999999=+Form32!C52","999999=+Form32!C53","999999=+Form32!C54","999999=+Form32!C55","999999=+Form32!C56","999999=+Form32!C57","999999=+Form32!C58","999999=+Form32!D47","999999=+Form32!D48","999999=+Form32!D49","999999=+Form32!D50","999999=+Form32!D51","999999=+Form32!D52","999999=+Form32!D53","999999=+Form32!D54","999999=+Form32!D55","999999=+Form32!D56","999999=+Form32!D57","999999=+Form32!D58","999999=+Form32!E47","999999=+Form32!E48","999999=+Form32!E49","999999=+Form32!E50","999999=+Form32!E51","999999=+Form32!E52","999999=+Form32!E53","999999=+Form32!E54","999999=+Form32!E55","999999=+Form32!E56","999999=+Form32!E57","999999=+Form32!E58","999999=+Form32!$C$60","999999=+Form32!C64","999999=+Form32!C65",null,"999999=+Form32!C66","999999=+Form32!C67","999999=+Form32!$E$67","999999=+Form32!C68","999999=+Form32!C69","999999=+Form32!E69","999999=+Form32!C70","999999=+Form32!C71","999999=+Form32!C72","999999=+Form32!C73","999999=+Form32!E73","999999=+Form32!C78","999999=+Form32!C79","999999=+Form32!C80","999999=+Form32!D78","999999=+Form32!D79","999999=+Form32!D80","999999=+Form32!E78","999999=+Form32!E79","999999=+Form32!E80","999999=+Form32!C82","999999=+Form32!C95","999999=+Form32!D95","999999=+Form32!C96","999999=+Form32!D96","999999=+Form32!C97","999999=+Form32!D97","999999=+Form32!D98","999999=+Form32!D99",0,"999999=+Form32!D100","999999=+Form32!E95","999999=+Form32!F95","999999=+Form32!E96","999999=+Form32!F96","999999=+Form32!E97","999999=+Form32!F97","999999=+Form32!F98","999999=+Form32!F99",0,"999999=+Form32!F100","999999=+Form32!G95","999999=+Form32!H95","999999=+Form32!G96","999999=+Form32!H96","999999=+Form32!G97","999999=+Form32!H97","999999=+Form32!H98","999999=+Form32!H99",0,"999999=+Form32!H100","999999=+Form32!C105","999999=+Form32!D105","999999=+Form32!C106","999999=+Form32!D106","999999=+Form32!C107","999999=+Form32!D107","999999=+Form32!D108","999999=+Form32!D109",0,"999999=+Form32!D110","999999=+Form32!E105","999999=+Form32!F105","999999=+Form32!E106","999999=+Form32!F106","999999=+Form32!E107","999999=+Form32!F107","999999=+Form32!F108","999999=+Form32!F109",0,"999999=+Form32!F110","999999=+Form32!G105","999999=+Form32!H105","999999=+Form32!G106","999999=+Form32!H106","999999=+Form32!G107","999999=+Form32!H107","999999=+Form32!H108","999999=+Form32!H109",0,"999999=+Form32!H110","999999=+Form32!J105","999999=+Form32!J106","999999=+Form32!C123",null,"999999=+Form32!D123","999999=+Form32!C124","999999=+Form32!C125","999999=+Form32!C126","999999=+Form32!C127","999999=+Form32!C129","Non-Divested"]
[33,"999999=+MID(CELL(\"filename\",A1),FIND(\"[\",CELL(\"filename\",A1))+1,FIND(\"]\", CELL(\"filename\",A1))-FIND(\"[\",CELL(\"filename\",A1))-1)",null,null,"999999=+Form33!E5",33,"999999=+Form33!C7",null,"999999=+Form33!C8","999999=+Form33!C9","999999=+Form33!C10","999999=+Form33!C11","999999=+Form33!E11","999999=+Form33!F11","999999=+Form33!C12","999999=+Form33!C16","999999=+Form33!C17","999999=+Form33!E17","999999=+Form33!F17","999999=+Form33!C18","999999=+Form33!F18","999999=+Form33!C19","999999=+Form33!C20","999999=+Form33!E20","999999=+Form33!C24","999999=+Form33!C25","999999=+Form33!C26","999999=+Form33!F26","999999=+Form33!C27","999999=+Form33!C28","999999=+Form33!E28","999999=+Form33!F28","999999=+Form33!C29","999999=+Form33!C30","999999=+Form33!C31","999999=+Form33!C32","999999=+Form33!C33","999999=+Form33!C37",null,"999999=+Form33!C38",null,"999999=+Form33!C39",null,"999999=+Form33!C40",null,"999999=+Form33!C41","999999=+Form33!C47","999999=+Form33!C48","999999=+Form33!C49","999999=+Form33!C50","999999=+Form33!C51","999999=+Form33!C52","999999=+Form33!C53","999999=+Form33!C54","999999=+Form33!C55","999999=+Form33!C56","999999=+Form33!C57","999999=+Form33!C58","999999=+Form33!D47","999999=+Form33!D48","999999=+Form33!D49","999999=+Form33!D50","999999=+Form33!D51","999999=+Form33!D52","999999=+Form33!D53","999999=+Form33!D54","999999=+Form33!D55","999999=+Form33!D56","999999=+Form33!D57","999999=+Form33!D58","999999=+Form33!E47","999999=+Form33!E48","999999=+Form33!E49","999999=+Form33!E50","999999=+Form33!E51","999999=+Form33!E52","999999=+Form33!E53","999999=+Form33!E54","999999=+Form33!E55","999999=+Form33!E56","999999=+Form33!E57","999999=+Form33!E58","999999=+Form33!$C$60","999999=+Form33!C64","999999=+Form33!C65",null,"999999=+Form33!C66","999999=+Form33!C67","999999=+Form33!$E$67","999999=+Form33!C68","999999=+Form33!C69","999999=+Form33!E69","999999=+Form33!C70","999999=+Form33!C71","999999=+Form33!C72","999999=+Form33!C73","999999=+Form33!E73","999999=+Form33!C78","999999=+Form33!C79","999999=+Form33!C80","999999=+Form33!D78","999999=+Form33!D79","999999=+Form33!D80","999999=+Form33!E78","999999=+Form33!E79","999999=+Form33!E80","999999=+Form33!C82","999999=+Form33!C95","999999=+Form33!D95","999999=+Form33!C96","999999=+Form33!D96","999999=+Form33!C97","999999=+Form33!D97","999999=+Form33!D98","999999=+Form33!D99",0,"999999=+Form33!D100","999999=+Form33!E95","999999=+Form33!F95","999999=+Form33!E96","999999=+Form33!F96","999999=+Form33!E97","999999=+Form33!F97","999999=+Form33!F98","999999=+Form33!F99",0,"999999=+Form33!F100","999999=+Form33!G95","999999=+Form33!H95","999999=+Form33!G96","999999=+Form33!H96","999999=+Form33!G97","999999=+Form33!H97","999999=+Form33!H98","999999=+Form33!H99",0,"999999=+Form33!H100","999999=+Form33!C105","999999=+Form33!D105","999999=+Form33!C106","999999=+Form33!D106","999999=+Form33!C107","999999=+Form33!D107","999999=+Form33!D108","999999=+Form33!D109",0,"999999=+Form33!D110","999999=+Form33!E105","999999=+Form33!F105","999999=+Form33!E106","999999=+Form33!F106","999999=+Form33!E107","999999=+Form33!F107","999999=+Form33!F108","999999=+Form33!F109",0,"999999=+Form33!F110","999999=+Form33!G105","999999=+Form33!H105","999999=+Form33!G106","999999=+Form33!H106","999999=+Form33!G107","999999=+Form33!H107","999999=+Form33!H108","999999=+Form33!H109",0,"999999=+Form33!H110","999999=+Form33!J105","999999=+Form33!J106","999999=+Form33!C123",null,"999999=+Form33!D123","999999=+Form33!C124","999999=+Form33!C125","999999=+Form33!C126","999999=+Form33!C127","999999=+Form33!C129","Non-Divested"]
[34,"999999=+MID(CELL(\"filename\",A1),FIND(\"[\",CELL(\"filename\",A1))+1,FIND(\"]\", CELL(\"filename\",A1))-FIND(\"[\",CELL(\"filename\",A1))-1)",null,null,"999999=+Form34!E5",34,"999999=+Form34!C7",null,"999999=+Form34!C8","999999=+Form34!C9","999999=+Form34!C10","999999=+Form34!C11","999999=+Form34!E11","999999=+Form34!F11","999999=+Form34!C12","999999=+Form34!C16","999999=+Form34!C17","999999=+Form34!E17","999999=+Form34!F17","999999=+Form34!C18","999999=+Form34!F18","999999=+Form34!C19","999999=+Form34!C20","999999=+Form34!E20","999999=+Form34!C24","999999=+Form34!C25","999999=+Form34!C26","999999=+Form34!F26","999999=+Form34!C27","999999=+Form34!C28","999999=+Form34!E28","999999=+Form34!F28","999999=+Form34!C29","999999=+Form34!C30","999999=+Form34!C31","999999=+Form34!C32","999999=+Form34!C33","999999=+Form34!C37",null,"999999=+Form34!C38",null,"999999=+Form34!C39",null,"999999=+Form34!C40",null,"999999=+Form34!C41","999999=+Form34!C47","999999=+Form34!C48","999999=+Form34!C49","999999=+Form34!C50","999999=+Form34!C51","999999=+Form34!C52","999999=+Form34!C53","999999=+Form34!C54","999999=+Form34!C55","999999=+Form34!C56","999999=+Form34!C57","999999=+Form34!C58","999999=+Form34!D47","999999=+Form34!D48","999999=+Form34!D49","999999=+Form34!D50","999999=+Form34!D51","999999=+Form34!D52","999999=+Form34!D53","999999=+Form34!D54","999999=+Form34!D55","999999=+Form34!D56","999999=+Form34!D57","999999=+Form34!D58","999999=+Form34!E47","999999=+Form34!E48","999999=+Form34!E49","999999=+Form34!E50","999999=+Form34!E51","999999=+Form34!E52","999999=+Form34!E53","999999=+Form34!E54","999999=+Form34!E55","999999=+Form34!E56","999999=+Form34!E57","999999=+Form34!E58","999999=+Form34!$C$60","999999=+Form34!C64","999999=+Form34!C65",null,"999999=+Form34!C66","999999=+Form34!C67","999999=+Form34!$E$67","999999=+Form34!C68","999999=+Form34!C69","999999=+Form34!E69","999999=+Form34!C70","999999=+Form34!C71","999999=+Form34!C72","999999=+Form34!C73","999999=+Form34!E73","999999=+Form34!C78","999999=+Form34!C79","999999=+Form34!C80","999999=+Form34!D78","999999=+Form34!D79","999999=+Form34!D80","999999=+Form34!E78","999999=+Form34!E79","999999=+Form34!E80","999999=+Form34!C82","999999=+Form34!C95","999999=+Form34!D95","999999=+Form34!C96","999999=+Form34!D96","999999=+Form34!C97","999999=+Form34!D97","999999=+Form34!D98","999999=+Form34!D99",0,"999999=+Form34!D100","999999=+Form34!E95","999999=+Form34!F95","999999=+Form34!E96","999999=+Form34!F96","999999=+Form34!E97","999999=+Form34!F97","999999=+Form34!F98","999999=+Form34!F99",0,"999999=+Form34!F100","999999=+Form34!G95","999999=+Form34!H95","999999=+Form34!G96","999999=+Form34!H96","999999=+Form34!G97","999999=+Form34!H97","999999=+Form34!H98","999999=+Form34!H99",0,"999999=+Form34!H100","999999=+Form34!C105","999999=+Form34!D105","999999=+Form34!C106","999999=+Form34!D106","999999=+Form34!C107","999999=+Form34!D107","999999=+Form34!D108","999999=+Form34!D109",0,"999999=+Form34!D110","999999=+Form34!E105","999999=+Form34!F105","999999=+Form34!E106","999999=+Form34!F106","999999=+Form34!E107","999999=+Form34!F107","999999=+Form34!F108","999999=+Form34!F109",0,"999999=+Form34!F110","999999=+Form34!G105","999999=+Form34!H105","999999=+Form34!G106","999999=+Form34!H106","999999=+Form34!G107","999999=+Form34!H107","999999=+Form34!H108","999999=+Form34!H109",0,"999999=+Form34!H110","999999=+Form34!J105","999999=+Form34!J106","999999=+Form34!C123",null,"999999=+Form34!D123","999999=+Form34!C124","999999=+Form34!C125","999999=+Form34!C126","999999=+Form34!C127","999999=+Form34!C129","Non-Divested"]
[35,"999999=+MID(CELL(\"filename\",A1),FIND(\"[\",CELL(\"filename\",A1))+1,FIND(\"]\", CELL(\"filename\",A1))-FIND(\"[\",CELL(\"filename\",A1))-1)",null,null,"999999=+Form35!E5",35,"999999=+Form35!C7",null,"999999=+Form35!C8","999999=+Form35!C9","999999=+Form35!C10","999999=+Form35!C11","999999=+Form35!E11","999999=+Form35!F11","999999=+Form35!C12","999999=+Form35!C16","999999=+Form35!C17","999999=+Form35!E17","999999=+Form35!F17","999999=+Form35!C18","999999=+Form35!F18","999999=+Form35!C19","999999=+Form35!C20","999999=+Form35!E20","999999=+Form35!C24","999999=+Form35!C25","999999=+Form35!C26","999999=+Form35!F26","999999=+Form35!C27","999999=+Form35!C28","999999=+Form35!E28","999999=+Form35!F28","999999=+Form35!C29","999999=+Form35!C30","999999=+Form35!C31","999999=+Form35!C32","999999=+Form35!C33","999999=+Form35!C37",null,"999999=+Form35!C38",null,"999999=+Form35!C39",null,"999999=+Form35!C40",null,"999999=+Form35!C41","999999=+Form35!C47","999999=+Form35!C48","999999=+Form35!C49","999999=+Form35!C50","999999=+Form35!C51","999999=+Form35!C52","999999=+Form35!C53","999999=+Form35!C54","999999=+Form35!C55","999999=+Form35!C56","999999=+Form35!C57","999999=+Form35!C58","999999=+Form35!D47","999999=+Form35!D48","999999=+Form35!D49","999999=+Form35!D50","999999=+Form35!D51","999999=+Form35!D52","999999=+Form35!D53","999999=+Form35!D54","999999=+Form35!D55","999999=+Form35!D56","999999=+Form35!D57","999999=+Form35!D58","999999=+Form35!E47","999999=+Form35!E48","999999=+Form35!E49","999999=+Form35!E50","999999=+Form35!E51","999999=+Form35!E52","999999=+Form35!E53","999999=+Form35!E54","999999=+Form35!E55","999999=+Form35!E56","999999=+Form35!E57","999999=+Form35!E58","999999=+Form35!$C$60","999999=+Form35!C64","999999=+Form35!C65",null,"999999=+Form35!C66","999999=+Form35!C67","999999=+Form35!$E$67","999999=+Form35!C68","999999=+Form35!C69","999999=+Form35!E69","999999=+Form35!C70","999999=+Form35!C71","999999=+Form35!C72","999999=+Form35!C73","999999=+Form35!E73","999999=+Form35!C78","999999=+Form35!C79","999999=+Form35!C80","999999=+Form35!D78","999999=+Form35!D79","999999=+Form35!D80","999999=+Form35!E78","999999=+Form35!E79","999999=+Form35!E80","999999=+Form35!C82","999999=+Form35!C95","999999=+Form35!D95","999999=+Form35!C96","999999=+Form35!D96","999999=+Form35!C97","999999=+Form35!D97","999999=+Form35!D98","999999=+Form35!D99",0,"999999=+Form35!D100","999999=+Form35!E95","999999=+Form35!F95","999999=+Form35!E96","999999=+Form35!F96","999999=+Form35!E97","999999=+Form35!F97","999999=+Form35!F98","999999=+Form35!F99",0,"999999=+Form35!F100","999999=+Form35!G95","999999=+Form35!H95","999999=+Form35!G96","999999=+Form35!H96","999999=+Form35!G97","999999=+Form35!H97","999999=+Form35!H98","999999=+Form35!H99",0,"999999=+Form35!H100","999999=+Form35!C105","999999=+Form35!D105","999999=+Form35!C106","999999=+Form35!D106","999999=+Form35!C107","999999=+Form35!D107","999999=+Form35!D108","999999=+Form35!D109",0,"999999=+Form35!D110","999999=+Form35!E105","999999=+Form35!F105","999999=+Form35!E106","999999=+Form35!F106","999999=+Form35!E107","999999=+Form35!F107","999999=+Form35!F108","999999=+Form35!F109",0,"999999=+Form35!F110","999999=+Form35!G105","999999=+Form35!H105","999999=+Form35!G106","999999=+Form35!H106","999999=+Form35!G107","999999=+Form35!H107","999999=+Form35!H108","999999=+Form35!H109",0,"999999=+Form35!H110","999999=+Form35!J105","999999=+Form35!J106","999999=+Form35!C123",null,"999999=+Form35!D123","999999=+Form35!C124","999999=+Form35!C125","999999=+Form35!C126","999999=+Form35!C127","999999=+Form35!C129","Non-Divested"]
[36,"999999=+MID(CELL(\"filename\",A1),FIND(\"[\",CELL(\"filename\",A1))+1,FIND(\"]\", CELL(\"filename\",A1))-FIND(\"[\",CELL(\"filename\",A1))-1)",null,null,"999999=+Form36!E5",36,"999999=+Form36!C7",null,"999999=+Form36!C8","999999=+Form36!C9","999999=+Form36!C10","999999=+Form36!C11","999999=+Form36!E11","999999=+Form36!F11","999999=+Form36!C12","999999=+Form36!C16","999999=+Form36!C17","999999=+Form36!E17","999999=+Form36!F17","999999=+Form36!C18","999999=+Form36!F18","999999=+Form36!C19","999999=+Form36!C20","999999=+Form36!E20","999999=+Form36!C24","999999=+Form36!C25","999999=+Form36!C26","999999=+Form36!F26","999999=+Form36!C27","999999=+Form36!C28","999999=+Form36!E28","999999=+Form36!F28","999999=+Form36!C29","999999=+Form36!C30","999999=+Form36!C31","999999=+Form36!C32","999999=+Form36!C33","999999=+Form36!C37",null,"999999=+Form36!C38",null,"999999=+Form36!C39",null,"999999=+Form36!C40",null,"999999=+Form36!C41","999999=+Form36!C47","999999=+Form36!C48","999999=+Form36!C49","999999=+Form36!C50","999999=+Form36!C51","999999=+Form36!C52","999999=+Form36!C53","999999=+Form36!C54","999999=+Form36!C55","999999=+Form36!C56","999999=+Form36!C57","999999=+Form36!C58","999999=+Form36!D47","999999=+Form36!D48","999999=+Form36!D49","999999=+Form36!D50","999999=+Form36!D51","999999=+Form36!D52","999999=+Form36!D53","999999=+Form36!D54","999999=+Form36!D55","999999=+Form36!D56","999999=+Form36!D57","999999=+Form36!D58","999999=+Form36!E47","999999=+Form36!E48","999999=+Form36!E49","999999=+Form36!E50","999999=+Form36!E51","999999=+Form36!E52","999999=+Form36!E53","999999=+Form36!E54","999999=+Form36!E55","999999=+Form36!E56","999999=+Form36!E57","999999=+Form36!E58","999999=+Form36!$C$60","999999=+Form36!C64","999999=+Form36!C65",null,"999999=+Form36!C66","999999=+Form36!C67","999999=+Form36!$E$67","999999=+Form36!C68","999999=+Form36!C69","999999=+Form36!E69","999999=+Form36!C70","999999=+Form36!C71","999999=+Form36!C72","999999=+Form36!C73","999999=+Form36!E73","999999=+Form36!C78","999999=+Form36!C79","999999=+Form36!C80","999999=+Form36!D78","999999=+Form36!D79","999999=+Form36!D80","999999=+Form36!E78","999999=+Form36!E79","999999=+Form36!E80","999999=+Form36!C82","999999=+Form36!C95","999999=+Form36!D95","999999=+Form36!C96","999999=+Form36!D96","999999=+Form36!C97","999999=+Form36!D97","999999=+Form36!D98","999999=+Form36!D99",0,"999999=+Form36!D100","999999=+Form36!E95","999999=+Form36!F95","999999=+Form36!E96","999999=+Form36!F96","999999=+Form36!E97","999999=+Form36!F97","999999=+Form36!F98","999999=+Form36!F99",0,"999999=+Form36!F100","999999=+Form36!G95","999999=+Form36!H95","999999=+Form36!G96","999999=+Form36!H96","999999=+Form36!G97","999999=+Form36!H97","999999=+Form36!H98","999999=+Form36!H99",0,"999999=+Form36!H100","999999=+Form36!C105","999999=+Form36!D105","999999=+Form36!C106","999999=+Form36!D106","999999=+Form36!C107","999999=+Form36!D107","999999=+Form36!D108","999999=+Form36!D109",0,"999999=+Form36!D110","999999=+Form36!E105","999999=+Form36!F105","999999=+Form36!E106","999999=+Form36!F106","999999=+Form36!E107","999999=+Form36!F107","999999=+Form36!F108","999999=+Form36!F109",0,"999999=+Form36!F110","999999=+Form36!G105","999999=+Form36!H105","999999=+Form36!G106","999999=+Form36!H106","999999=+Form36!G107","999999=+Form36!H107","999999=+Form36!H108","999999=+Form36!H109",0,"999999=+Form36!H110","999999=+Form36!J105","999999=+Form36!J106","999999=+Form36!C123",null,"999999=+Form36!D123","999999=+Form36!C124","999999=+Form36!C125","999999=+Form36!C126","999999=+Form36!C127","999999=+Form36!C129","Non-Divested"]
[37,"999999=+MID(CELL(\"filename\",A1),FIND(\"[\",CELL(\"filename\",A1))+1,FIND(\"]\", CELL(\"filename\",A1))-FIND(\"[\",CELL(\"filename\",A1))-1)",null,null,"999999=+Form37!E5",37,"999999=+Form37!C7",null,"999999=+Form37!C8","999999=+Form37!C9","999999=+Form37!C10","999999=+Form37!C11","999999=+Form37!E11","999999=+Form37!F11","999999=+Form37!C12","999999=+Form37!C16","999999=+Form37!C17","999999=+Form37!E17","999999=+Form37!F17","999999=+Form37!C18","999999=+Form37!F18","999999=+Form37!C19","999999=+Form37!C20","999999=+Form37!E20","999999=+Form37!C24","999999=+Form37!C25","999999=+Form37!C26","999999=+Form37!F26","999999=+Form37!C27","999999=+Form37!C28","999999=+Form37!E28","999999=+Form37!F28","999999=+Form37!C29","999999=+Form37!C30","999999=+Form37!C31","999999=+Form37!C32","999999=+Form37!C33","999999=+Form37!C37",null,"999999=+Form37!C38",null,"999999=+Form37!C39",null,"999999=+Form37!C40",null,"999999=+Form37!C41","999999=+Form37!C47","999999=+Form37!C48","999999=+Form37!C49","999999=+Form37!C50","999999=+Form37!C51","999999=+Form37!C52","999999=+Form37!C53","999999=+Form37!C54","999999=+Form37!C55","999999=+Form37!C56","999999=+Form37!C57","999999=+Form37!C58","999999=+Form37!D47","999999=+Form37!D48","999999=+Form37!D49","999999=+Form37!D50","999999=+Form37!D51","999999=+Form37!D52","999999=+Form37!D53","999999=+Form37!D54","999999=+Form37!D55","999999=+Form37!D56","999999=+Form37!D57","999999=+Form37!D58","999999=+Form37!E47","999999=+Form37!E48","999999=+Form37!E49","999999=+Form37!E50","999999=+Form37!E51","999999=+Form37!E52","999999=+Form37!E53","999999=+Form37!E54","999999=+Form37!E55","999999=+Form37!E56","999999=+Form37!E57","999999=+Form37!E58","999999=+Form37!$C$60","999999=+Form37!C64","999999=+Form37!C65",null,"999999=+Form37!C66","999999=+Form37!C67","999999=+Form37!$E$67","999999=+Form37!C68","999999=+Form37!C69","999999=+Form37!E69","999999=+Form37!C70","999999=+Form37!C71","999999=+Form37!C72","999999=+Form37!C73","999999=+Form37!E73","999999=+Form37!C78","999999=+Form37!C79","999999=+Form37!C80","999999=+Form37!D78","999999=+Form37!D79","999999=+Form37!D80","999999=+Form37!E78","999999=+Form37!E79","999999=+Form37!E80","999999=+Form37!C82","999999=+Form37!C95","999999=+Form37!D95","999999=+Form37!C96","999999=+Form37!D96","999999=+Form37!C97","999999=+Form37!D97","999999=+Form37!D98","999999=+Form37!D99",0,"999999=+Form37!D100","999999=+Form37!E95","999999=+Form37!F95","999999=+Form37!E96","999999=+Form37!F96","999999=+Form37!E97","999999=+Form37!F97","999999=+Form37!F98","999999=+Form37!F99",0,"999999=+Form37!F100","999999=+Form37!G95","999999=+Form37!H95","999999=+Form37!G96","999999=+Form37!H96","999999=+Form37!G97","999999=+Form37!H97","999999=+Form37!H98","999999=+Form37!H99",0,"999999=+Form37!H100","999999=+Form37!C105","999999=+Form37!D105","999999=+Form37!C106","999999=+Form37!D106","999999=+Form37!C107","999999=+Form37!D107","999999=+Form37!D108","999999=+Form37!D109",0,"999999=+Form37!D110","999999=+Form37!E105","999999=+Form37!F105","999999=+Form37!E106","999999=+Form37!F106","999999=+Form37!E107","999999=+Form37!F107","999999=+Form37!F108","999999=+Form37!F109",0,"999999=+Form37!F110","999999=+Form37!G105","999999=+Form37!H105","999999=+Form37!G106","999999=+Form37!H106","999999=+Form37!G107","999999=+Form37!H107","999999=+Form37!H108","999999=+Form37!H109",0,"999999=+Form37!H110","999999=+Form37!J105","999999=+Form37!J106","999999=+Form37!C123",null,"999999=+Form37!D123","999999=+Form37!C124","999999=+Form37!C125","999999=+Form37!C126","999999=+Form37!C127","999999=+Form37!C129","Non-Divested"]
[38,"999999=+MID(CELL(\"filename\",A1),FIND(\"[\",CELL(\"filename\",A1))+1,FIND(\"]\", CELL(\"filename\",A1))-FIND(\"[\",CELL(\"filename\",A1))-1)",null,null,"999999=+Form38!E5",38,"999999=+Form38!C7",null,"999999=+Form38!C8","999999=+Form38!C9","999999=+Form38!C10","999999=+Form38!C11","999999=+Form38!E11","999999=+Form38!F11","999999=+Form38!C12","999999=+Form38!C16","999999=+Form38!C17","999999=+Form38!E17","999999=+Form38!F17","999999=+Form38!C18","999999=+Form38!F18","999999=+Form38!C19","999999=+Form38!C20","999999=+Form38!E20","999999=+Form38!C24","999999=+Form38!C25","999999=+Form38!C26","999999=+Form38!F26","999999=+Form38!C27","999999=+Form38!C28","999999=+Form38!E28","999999=+Form38!F28","999999=+Form38!C29","999999=+Form38!C30","999999=+Form38!C31","999999=+Form38!C32","999999=+Form38!C33","999999=+Form38!C37",null,"999999=+Form38!C38",null,"999999=+Form38!C39",null,"999999=+Form38!C40",null,"999999=+Form38!C41","999999=+Form38!C47","999999=+Form38!C48","999999=+Form38!C49","999999=+Form38!C50","999999=+Form38!C51","999999=+Form38!C52","999999=+Form38!C53","999999=+Form38!C54","999999=+Form38!C55","999999=+Form38!C56","999999=+Form38!C57","999999=+Form38!C58","999999=+Form38!D47","999999=+Form38!D48","999999=+Form38!D49","999999=+Form38!D50","999999=+Form38!D51","999999=+Form38!D52","999999=+Form38!D53","999999=+Form38!D54","999999=+Form38!D55","999999=+Form38!D56","999999=+Form38!D57","999999=+Form38!D58","999999=+Form38!E47","999999=+Form38!E48","999999=+Form38!E49","999999=+Form38!E50","999999=+Form38!E51","999999=+Form38!E52","999999=+Form38!E53","999999=+Form38!E54","999999=+Form38!E55","999999=+Form38!E56","999999=+Form38!E57","999999=+Form38!E58","999999=+Form38!$C$60","999999=+Form38!C64","999999=+Form38!C65",null,"999999=+Form38!C66","999999=+Form38!C67","999999=+Form38!$E$67","999999=+Form38!C68","999999=+Form38!C69","999999=+Form38!E69","999999=+Form38!C70","999999=+Form38!C71","999999=+Form38!C72","999999=+Form38!C73","999999=+Form38!E73","999999=+Form38!C78","999999=+Form38!C79","999999=+Form38!C80","999999=+Form38!D78","999999=+Form38!D79","999999=+Form38!D80","999999=+Form38!E78","999999=+Form38!E79","999999=+Form38!E80","999999=+Form38!C82","999999=+Form38!C95","999999=+Form38!D95","999999=+Form38!C96","999999=+Form38!D96","999999=+Form38!C97","999999=+Form38!D97","999999=+Form38!D98","999999=+Form38!D99",0,"999999=+Form38!D100","999999=+Form38!E95","999999=+Form38!F95","999999=+Form38!E96","999999=+Form38!F96","999999=+Form38!E97","999999=+Form38!F97","999999=+Form38!F98","999999=+Form38!F99",0,"999999=+Form38!F100","999999=+Form38!G95","999999=+Form38!H95","999999=+Form38!G96","999999=+Form38!H96","999999=+Form38!G97","999999=+Form38!H97","999999=+Form38!H98","999999=+Form38!H99",0,"999999=+Form38!H100","999999=+Form38!C105","999999=+Form38!D105","999999=+Form38!C106","999999=+Form38!D106","999999=+Form38!C107","999999=+Form38!D107","999999=+Form38!D108","999999=+Form38!D109",0,"999999=+Form38!D110","999999=+Form38!E105","999999=+Form38!F105","999999=+Form38!E106","999999=+Form38!F106","999999=+Form38!E107","999999=+Form38!F107","999999=+Form38!F108","999999=+Form38!F109",0,"999999=+Form38!F110","999999=+Form38!G105","999999=+Form38!H105","999999=+Form38!G106","999999=+Form38!H106","999999=+Form38!G107","999999=+Form38!H107","999999=+Form38!H108","999999=+Form38!H109",0,"999999=+Form38!H110","999999=+Form38!J105","999999=+Form38!J106","999999=+Form38!C123",null,"999999=+Form38!D123","999999=+Form38!C124","999999=+Form38!C125","999999=+Form38!C126","999999=+Form38!C127","999999=+Form38!C129","Non-Divested"]
[39,"999999=+MID(CELL(\"filename\",A1),FIND(\"[\",CELL(\"filename\",A1))+1,FIND(\"]\", CELL(\"filename\",A1))-FIND(\"[\",CELL(\"filename\",A1))-1)",null,null,"999999=+Form39!E5",39,"999999=+Form39!C7",null,"999999=+Form39!C8","999999=+Form39!C9","999999=+Form39!C10","999999=+Form39!C11","999999=+Form39!E11","999999=+Form39!F11","999999=+Form39!C12","999999=+Form39!C16","999999=+Form39!C17","999999=+Form39!E17","999999=+Form39!F17","999999=+Form39!C18","999999=+Form39!F18","999999=+Form39!C19","999999=+Form39!C20","999999=+Form39!E20","999999=+Form39!C24","999999=+Form39!C25","999999=+Form39!C26","999999=+Form39!F26","999999=+Form39!C27","999999=+Form39!C28","999999=+Form39!E28","999999=+Form39!F28","999999=+Form39!C29","999999=+Form39!C30","999999=+Form39!C31","999999=+Form39!C32","999999=+Form39!C33","999999=+Form39!C37",null,"999999=+Form39!C38",null,"999999=+Form39!C39",null,"999999=+Form39!C40",null,"999999=+Form39!C41","999999=+Form39!C47","999999=+Form39!C48","999999=+Form39!C49","999999=+Form39!C50","999999=+Form39!C51","999999=+Form39!C52","999999=+Form39!C53","999999=+Form39!C54","999999=+Form39!C55","999999=+Form39!C56","999999=+Form39!C57","999999=+Form39!C58","999999=+Form39!D47","999999=+Form39!D48","999999=+Form39!D49","999999=+Form39!D50","999999=+Form39!D51","999999=+Form39!D52","999999=+Form39!D53","999999=+Form39!D54","999999=+Form39!D55","999999=+Form39!D56","999999=+Form39!D57","999999=+Form39!D58","999999=+Form39!E47","999999=+Form39!E48","999999=+Form39!E49","999999=+Form39!E50","999999=+Form39!E51","999999=+Form39!E52","999999=+Form39!E53","999999=+Form39!E54","999999=+Form39!E55","999999=+Form39!E56","999999=+Form39!E57","999999=+Form39!E58","999999=+Form39!$C$60","999999=+Form39!C64","999999=+Form39!C65",null,"999999=+Form39!C66","999999=+Form39!C67","999999=+Form39!$E$67","999999=+Form39!C68","999999=+Form39!C69","999999=+Form39!E69","999999=+Form39!C70","999999=+Form39!C71","999999=+Form39!C72","999999=+Form39!C73","999999=+Form39!E73","999999=+Form39!C78","999999=+Form39!C79","999999=+Form39!C80","999999=+Form39!D78","999999=+Form39!D79","999999=+Form39!D80","999999=+Form39!E78","999999=+Form39!E79","999999=+Form39!E80","999999=+Form39!C82","999999=+Form39!C95","999999=+Form39!D95","999999=+Form39!C96","999999=+Form39!D96","999999=+Form39!C97","999999=+Form39!D97","999999=+Form39!D98","999999=+Form39!D99",0,"999999=+Form39!D100","999999=+Form39!E95","999999=+Form39!F95","999999=+Form39!E96","999999=+Form39!F96","999999=+Form39!E97","999999=+Form39!F97","999999=+Form39!F98","999999=+Form39!F99",0,"999999=+Form39!F100","999999=+Form39!G95","999999=+Form39!H95","999999=+Form39!G96","999999=+Form39!H96","999999=+Form39!G97","999999=+Form39!H97","999999=+Form39!H98","999999=+Form39!H99",0,"999999=+Form39!H100","999999=+Form39!C105","999999=+Form39!D105","999999=+Form39!C106","999999=+Form39!D106","999999=+Form39!C107","999999=+Form39!D107","999999=+Form39!D108","999999=+Form39!D109",0,"999999=+Form39!D110","999999=+Form39!E105","999999=+Form39!F105","999999=+Form39!E106","999999=+Form39!F106","999999=+Form39!E107","999999=+Form39!F107","999999=+Form39!F108","999999=+Form39!F109",0,"999999=+Form39!F110","999999=+Form39!G105","999999=+Form39!H105","999999=+Form39!G106","999999=+Form39!H106","999999=+Form39!G107","999999=+Form39!H107","999999=+Form39!H108","999999=+Form39!H109",0,"999999=+Form39!H110","999999=+Form39!J105","999999=+Form39!J106","999999=+Form39!C123",null,"999999=+Form39!D123","999999=+Form39!C124","999999=+Form39!C125","999999=+Form39!C126","999999=+Form39!C127","999999=+Form39!C129","Non-Divested"]
[40,"999999=+MID(CELL(\"filename\",A1),FIND(\"[\",CELL(\"filename\",A1))+1,FIND(\"]\", CELL(\"filename\",A1))-FIND(\"[\",CELL(\"filename\",A1))-1)",null,null,"999999=+Form40!E5",40,"999999=+Form40!C7",null,"999999=+Form40!C8","999999=+Form40!C9","999999=+Form40!C10","999999=+Form40!C11","999999=+Form40!E11","999999=+Form40!F11","999999=+Form40!C12","999999=+Form40!C16","999999=+Form40!C17","999999=+Form40!E17","999999=+Form40!F17","999999=+Form40!C18","999999=+Form40!F18","999999=+Form40!C19","999999=+Form40!C20","999999=+Form40!E20","999999=+Form40!C24","999999=+Form40!C25","999999=+Form40!C26","999999=+Form40!F26","999999=+Form40!C27","999999=+Form40!C28","999999=+Form40!E28","999999=+Form40!F28","999999=+Form40!C29","999999=+Form40!C30","999999=+Form40!C31","999999=+Form40!C32","999999=+Form40!C33","999999=+Form40!C37",null,"999999=+Form40!C38",null,"999999=+Form40!C39",null,"999999=+Form40!C40",null,"999999=+Form40!C41","999999=+Form40!C47","999999=+Form40!C48","999999=+Form40!C49","999999=+Form40!C50","999999=+Form40!C51","999999=+Form40!C52","999999=+Form40!C53","999999=+Form40!C54","999999=+Form40!C55","999999=+Form40!C56","999999=+Form40!C57","999999=+Form40!C58","999999=+Form40!D47","999999=+Form40!D48","999999=+Form40!D49","999999=+Form40!D50","999999=+Form40!D51","999999=+Form40!D52","999999=+Form40!D53","999999=+Form40!D54","999999=+Form40!D55","999999=+Form40!D56","999999=+Form40!D57","999999=+Form40!D58","999999=+Form40!E47","999999=+Form40!E48","999999=+Form40!E49","999999=+Form40!E50","999999=+Form40!E51","999999=+Form40!E52","999999=+Form40!E53","999999=+Form40!E54","999999=+Form40!E55","999999=+Form40!E56","999999=+Form40!E57","999999=+Form40!E58","999999=+Form40!$C$60","999999=+Form40!C64","999999=+Form40!C65",null,"999999=+Form40!C66","999999=+Form40!C67","999999=+Form40!$E$67","999999=+Form40!C68","999999=+Form40!C69","999999=+Form40!E69","999999=+Form40!C70","999999=+Form40!C71","999999=+Form40!C72","999999=+Form40!C73","999999=+Form40!E73","999999=+Form40!C78","999999=+Form40!C79","999999=+Form40!C80","999999=+Form40!D78","999999=+Form40!D79","999999=+Form40!D80","999999=+Form40!E78","999999=+Form40!E79","999999=+Form40!E80","999999=+Form40!C82","999999=+Form40!C95","999999=+Form40!D95","999999=+Form40!C96","999999=+Form40!D96","999999=+Form40!C97","999999=+Form40!D97","999999=+Form40!D98","999999=+Form40!D99",0,"999999=+Form40!D100","999999=+Form40!E95","999999=+Form40!F95","999999=+Form40!E96","999999=+Form40!F96","999999=+Form40!E97","999999=+Form40!F97","999999=+Form40!F98","999999=+Form40!F99",0,"999999=+Form40!F100","999999=+Form40!G95","999999=+Form40!H95","999999=+Form40!G96","999999=+Form40!H96","999999=+Form40!G97","999999=+Form40!H97","999999=+Form40!H98","999999=+Form40!H99",0,"999999=+Form40!H100","999999=+Form40!C105","999999=+Form40!D105","999999=+Form40!C106","999999=+Form40!D106","999999=+Form40!C107","999999=+Form40!D107","999999=+Form40!D108","999999=+Form40!D109",0,"999999=+Form40!D110","999999=+Form40!E105","999999=+Form40!F105","999999=+Form40!E106","999999=+Form40!F106","999999=+Form40!E107","999999=+Form40!F107","999999=+Form40!F108","999999=+Form40!F109",0,"999999=+Form40!F110","999999=+Form40!G105","999999=+Form40!H105","999999=+Form40!G106","999999=+Form40!H106","999999=+Form40!G107","999999=+Form40!H107","999999=+Form40!H108","999999=+Form40!H109",0,"999999=+Form40!H110","999999=+Form40!J105","999999=+Form40!J106","999999=+Form40!C123",null,"999999=+Form40!D123","999999=+Form40!C124","999999=+Form40!C125","999999=+Form40!C126","999999=+Form40!C127","999999=+Form40!C129","Non-Divested"]
[41,"999999=+MID(CELL(\"filename\",A1),FIND(\"[\",CELL(\"filename\",A1))+1,FIND(\"]\", CELL(\"filename\",A1))-FIND(\"[\",CELL(\"filename\",A1))-1)",null,null,"999999=+Form41!E5",41,"999999=+Form41!C7",null,"999999=+Form41!C8","999999=+Form41!C9","999999=+Form41!C10","999999=+Form41!C11","999999=+Form41!E11","999999=+Form41!F11","999999=+Form41!C12","999999=+Form41!C16","999999=+Form41!C17","999999=+Form41!E17","999999=+Form41!F17","999999=+Form41!C18","999999=+Form41!F18","999999=+Form41!C19","999999=+Form41!C20","999999=+Form41!E20","999999=+Form41!C24","999999=+Form41!C25","999999=+Form41!C26","999999=+Form41!F26","999999=+Form41!C27","999999=+Form41!C28","999999=+Form41!E28","999999=+Form41!F28","999999=+Form41!C29","999999=+Form41!C30","999999=+Form41!C31","999999=+Form41!C32","999999=+Form41!C33","999999=+Form41!C37",null,"999999=+Form41!C38",null,"999999=+Form41!C39",null,"999999=+Form41!C40",null,"999999=+Form41!C41","999999=+Form41!C47","999999=+Form41!C48","999999=+Form41!C49","999999=+Form41!C50","999999=+Form41!C51","999999=+Form41!C52","999999=+Form41!C53","999999=+Form41!C54","999999=+Form41!C55","999999=+Form41!C56","999999=+Form41!C57","999999=+Form41!C58","999999=+Form41!D47","999999=+Form41!D48","999999=+Form41!D49","999999=+Form41!D50","999999=+Form41!D51","999999=+Form41!D52","999999=+Form41!D53","999999=+Form41!D54","999999=+Form41!D55","999999=+Form41!D56","999999=+Form41!D57","999999=+Form41!D58","999999=+Form41!E47","999999=+Form41!E48","999999=+Form41!E49","999999=+Form41!E50","999999=+Form41!E51","999999=+Form41!E52","999999=+Form41!E53","999999=+Form41!E54","999999=+Form41!E55","999999=+Form41!E56","999999=+Form41!E57","999999=+Form41!E58","999999=+Form41!$C$60","999999=+Form41!C64","999999=+Form41!C65",null,"999999=+Form41!C66","999999=+Form41!C67","999999=+Form41!$E$67","999999=+Form41!C68","999999=+Form41!C69","999999=+Form41!E69","999999=+Form41!C70","999999=+Form41!C71","999999=+Form41!C72","999999=+Form41!C73","999999=+Form41!E73","999999=+Form41!C78","999999=+Form41!C79","999999=+Form41!C80","999999=+Form41!D78","999999=+Form41!D79","999999=+Form41!D80","999999=+Form41!E78","999999=+Form41!E79","999999=+Form41!E80","999999=+Form41!C82","999999=+Form41!C95","999999=+Form41!D95","999999=+Form41!C96","999999=+Form41!D96","999999=+Form41!C97","999999=+Form41!D97","999999=+Form41!D98","999999=+Form41!D99",0,"999999=+Form41!D100","999999=+Form41!E95","999999=+Form41!F95","999999=+Form41!E96","999999=+Form41!F96","999999=+Form41!E97","999999=+Form41!F97","999999=+Form41!F98","999999=+Form41!F99",0,"999999=+Form41!F100","999999=+Form41!G95","999999=+Form41!H95","999999=+Form41!G96","999999=+Form41!H96","999999=+Form41!G97","999999=+Form41!H97","999999=+Form41!H98","999999=+Form41!H99",0,"999999=+Form41!H100","999999=+Form41!C105","999999=+Form41!D105","999999=+Form41!C106","999999=+Form41!D106","999999=+Form41!C107","999999=+Form41!D107","999999=+Form41!D108","999999=+Form41!D109",0,"999999=+Form41!D110","999999=+Form41!E105","999999=+Form41!F105","999999=+Form41!E106","999999=+Form41!F106","999999=+Form41!E107","999999=+Form41!F107","999999=+Form41!F108","999999=+Form41!F109",0,"999999=+Form41!F110","999999=+Form41!G105","999999=+Form41!H105","999999=+Form41!G106","999999=+Form41!H106","999999=+Form41!G107","999999=+Form41!H107","999999=+Form41!H108","999999=+Form41!H109",0,"999999=+Form41!H110","999999=+Form41!J105","999999=+Form41!J106","999999=+Form41!C123",null,"999999=+Form41!D123","999999=+Form41!C124","999999=+Form41!C125","999999=+Form41!C126","999999=+Form41!C127","999999=+Form41!C129","Non-Divested"]
[42,"999999=+MID(CELL(\"filename\",A1),FIND(\"[\",CELL(\"filename\",A1))+1,FIND(\"]\", CELL(\"filename\",A1))-FIND(\"[\",CELL(\"filename\",A1))-1)",null,null,"999999=+Form42!E5",42,"999999=+Form42!C7",null,"999999=+Form42!C8","999999=+Form42!C9","999999=+Form42!C10","999999=+Form42!C11","999999=+Form42!E11","999999=+Form42!F11","999999=+Form42!C12","999999=+Form42!C16","999999=+Form42!C17","999999=+Form42!E17","999999=+Form42!F17","999999=+Form42!C18","999999=+Form42!F18","999999=+Form42!C19","999999=+Form42!C20","999999=+Form42!E20","999999=+Form42!C24","999999=+Form42!C25","999999=+Form42!C26","999999=+Form42!F26","999999=+Form42!C27","999999=+Form42!C28","999999=+Form42!E28","999999=+Form42!F28","999999=+Form42!C29","999999=+Form42!C30","999999=+Form42!C31","999999=+Form42!C32","999999=+Form42!C33","999999=+Form42!C37",null,"999999=+Form42!C38",null,"999999=+Form42!C39",null,"999999=+Form42!C40",null,"999999=+Form42!C41","999999=+Form42!C47","999999=+Form42!C48","999999=+Form42!C49","999999=+Form42!C50","999999=+Form42!C51","999999=+Form42!C52","999999=+Form42!C53","999999=+Form42!C54","999999=+Form42!C55","999999=+Form42!C56","999999=+Form42!C57","999999=+Form42!C58","999999=+Form42!D47","999999=+Form42!D48","999999=+Form42!D49","999999=+Form42!D50","999999=+Form42!D51","999999=+Form42!D52","999999=+Form42!D53","999999=+Form42!D54","999999=+Form42!D55","999999=+Form42!D56","999999=+Form42!D57","999999=+Form42!D58","999999=+Form42!E47","999999=+Form42!E48","999999=+Form42!E49","999999=+Form42!E50","999999=+Form42!E51","999999=+Form42!E52","999999=+Form42!E53","999999=+Form42!E54","999999=+Form42!E55","999999=+Form42!E56","999999=+Form42!E57","999999=+Form42!E58","999999=+Form42!$C$60","999999=+Form42!C64","999999=+Form42!C65",null,"999999=+Form42!C66","999999=+Form42!C67","999999=+Form42!$E$67","999999=+Form42!C68","999999=+Form42!C69","999999=+Form42!E69","999999=+Form42!C70","999999=+Form42!C71","999999=+Form42!C72","999999=+Form42!C73","999999=+Form42!E73","999999=+Form42!C78","999999=+Form42!C79","999999=+Form42!C80","999999=+Form42!D78","999999=+Form42!D79","999999=+Form42!D80","999999=+Form42!E78","999999=+Form42!E79","999999=+Form42!E80","999999=+Form42!C82","999999=+Form42!C95","999999=+Form42!D95","999999=+Form42!C96","999999=+Form42!D96","999999=+Form42!C97","999999=+Form42!D97","999999=+Form42!D98","999999=+Form42!D99",0,"999999=+Form42!D100","999999=+Form42!E95","999999=+Form42!F95","999999=+Form42!E96","999999=+Form42!F96","999999=+Form42!E97","999999=+Form42!F97","999999=+Form42!F98","999999=+Form42!F99",0,"999999=+Form42!F100","999999=+Form42!G95","999999=+Form42!H95","999999=+Form42!G96","999999=+Form42!H96","999999=+Form42!G97","999999=+Form42!H97","999999=+Form42!H98","999999=+Form42!H99",0,"999999=+Form42!H100","999999=+Form42!C105","999999=+Form42!D105","999999=+Form42!C106","999999=+Form42!D106","999999=+Form42!C107","999999=+Form42!D107","999999=+Form42!D108","999999=+Form42!D109",0,"999999=+Form42!D110","999999=+Form42!E105","999999=+Form42!F105","999999=+Form42!E106","999999=+Form42!F106","999999=+Form42!E107","999999=+Form42!F107","999999=+Form42!F108","999999=+Form42!F109",0,"999999=+Form42!F110","999999=+Form42!G105","999999=+Form42!H105","999999=+Form42!G106","999999=+Form42!H106","999999=+Form42!G107","999999=+Form42!H107","999999=+Form42!H108","999999=+Form42!H109",0,"999999=+Form42!H110","999999=+Form42!J105","999999=+Form42!J106","999999=+Form42!C123",null,"999999=+Form42!D123","999999=+Form42!C124","999999=+Form42!C125","999999=+Form42!C126","999999=+Form42!C127","999999=+Form42!C129","Non-Divested"]
[43,"999999=+MID(CELL(\"filename\",A1),FIND(\"[\",CELL(\"filename\",A1))+1,FIND(\"]\", CELL(\"filename\",A1))-FIND(\"[\",CELL(\"filename\",A1))-1)",null,null,"999999=+Form43!E5",43,"999999=+Form43!C7",null,"999999=+Form43!C8","999999=+Form43!C9","999999=+Form43!C10","999999=+Form43!C11","999999=+Form43!E11","999999=+Form43!F11","999999=+Form43!C12","999999=+Form43!C16","999999=+Form43!C17","999999=+Form43!E17","999999=+Form43!F17","999999=+Form43!C18","999999=+Form43!F18","999999=+Form43!C19","999999=+Form43!C20","999999=+Form43!E20","999999=+Form43!C24","999999=+Form43!C25","999999=+Form43!C26","999999=+Form43!F26","999999=+Form43!C27","999999=+Form43!C28","999999=+Form43!E28","999999=+Form43!F28","999999=+Form43!C29","999999=+Form43!C30","999999=+Form43!C31","999999=+Form43!C32","999999=+Form43!C33","999999=+Form43!C37",null,"999999=+Form43!C38",null,"999999=+Form43!C39",null,"999999=+Form43!C40",null,"999999=+Form43!C41","999999=+Form43!C47","999999=+Form43!C48","999999=+Form43!C49","999999=+Form43!C50","999999=+Form43!C51","999999=+Form43!C52","999999=+Form43!C53","999999=+Form43!C54","999999=+Form43!C55","999999=+Form43!C56","999999=+Form43!C57","999999=+Form43!C58","999999=+Form43!D47","999999=+Form43!D48","999999=+Form43!D49","999999=+Form43!D50","999999=+Form43!D51","999999=+Form43!D52","999999=+Form43!D53","999999=+Form43!D54","999999=+Form43!D55","999999=+Form43!D56","999999=+Form43!D57","999999=+Form43!D58","999999=+Form43!E47","999999=+Form43!E48","999999=+Form43!E49","999999=+Form43!E50","999999=+Form43!E51","999999=+Form43!E52","999999=+Form43!E53","999999=+Form43!E54","999999=+Form43!E55","999999=+Form43!E56","999999=+Form43!E57","999999=+Form43!E58","999999=+Form43!$C$60","999999=+Form43!C64","999999=+Form43!C65",null,"999999=+Form43!C66","999999=+Form43!C67","999999=+Form43!$E$67","999999=+Form43!C68","999999=+Form43!C69","999999=+Form43!E69","999999=+Form43!C70","999999=+Form43!C71","999999=+Form43!C72","999999=+Form43!C73","999999=+Form43!E73","999999=+Form43!C78","999999=+Form43!C79","999999=+Form43!C80","999999=+Form43!D78","999999=+Form43!D79","999999=+Form43!D80","999999=+Form43!E78","999999=+Form43!E79","999999=+Form43!E80","999999=+Form43!C82","999999=+Form43!C95","999999=+Form43!D95","999999=+Form43!C96","999999=+Form43!D96","999999=+Form43!C97","999999=+Form43!D97","999999=+Form43!D98","999999=+Form43!D99",0,"999999=+Form43!D100","999999=+Form43!E95","999999=+Form43!F95","999999=+Form43!E96","999999=+Form43!F96","999999=+Form43!E97","999999=+Form43!F97","999999=+Form43!F98","999999=+Form43!F99",0,"999999=+Form43!F100","999999=+Form43!G95","999999=+Form43!H95","999999=+Form43!G96","999999=+Form43!H96","999999=+Form43!G97","999999=+Form43!H97","999999=+Form43!H98","999999=+Form43!H99",0,"999999=+Form43!H100","999999=+Form43!C105","999999=+Form43!D105","999999=+Form43!C106","999999=+Form43!D106","999999=+Form43!C107","999999=+Form43!D107","999999=+Form43!D108","999999=+Form43!D109",0,"999999=+Form43!D110","999999=+Form43!E105","999999=+Form43!F105","999999=+Form43!E106","999999=+Form43!F106","999999=+Form43!E107","999999=+Form43!F107","999999=+Form43!F108","999999=+Form43!F109",0,"999999=+Form43!F110","999999=+Form43!G105","999999=+Form43!H105","999999=+Form43!G106","999999=+Form43!H106","999999=+Form43!G107","999999=+Form43!H107","999999=+Form43!H108","999999=+Form43!H109",0,"999999=+Form43!H110","999999=+Form43!J105","999999=+Form43!J106","999999=+Form43!C123",null,"999999=+Form43!D123","999999=+Form43!C124","999999=+Form43!C125","999999=+Form43!C126","999999=+Form43!C127","999999=+Form43!C129","Non-Divested"]
[44,"999999=+MID(CELL(\"filename\",A1),FIND(\"[\",CELL(\"filename\",A1))+1,FIND(\"]\", CELL(\"filename\",A1))-FIND(\"[\",CELL(\"filename\",A1))-1)",null,null,"999999=+Form44!E5",44,"999999=+Form44!C7",null,"999999=+Form44!C8","999999=+Form44!C9","999999=+Form44!C10","999999=+Form44!C11","999999=+Form44!E11","999999=+Form44!F11","999999=+Form44!C12","999999=+Form44!C16","999999=+Form44!C17","999999=+Form44!E17","999999=+Form44!F17","999999=+Form44!C18","999999=+Form44!F18","999999=+Form44!C19","999999=+Form44!C20","999999=+Form44!E20","999999=+Form44!C24","999999=+Form44!C25","999999=+Form44!C26","999999=+Form44!F26","999999=+Form44!C27","999999=+Form44!C28","999999=+Form44!E28","999999=+Form44!F28","999999=+Form44!C29","999999=+Form44!C30","999999=+Form44!C31","999999=+Form44!C32","999999=+Form44!C33","999999=+Form44!C37",null,"999999=+Form44!C38",null,"999999=+Form44!C39",null,"999999=+Form44!C40",null,"999999=+Form44!C41","999999=+Form44!C47","999999=+Form44!C48","999999=+Form44!C49","999999=+Form44!C50","999999=+Form44!C51","999999=+Form44!C52","999999=+Form44!C53","999999=+Form44!C54","999999=+Form44!C55","999999=+Form44!C56","999999=+Form44!C57","999999=+Form44!C58","999999=+Form44!D47","999999=+Form44!D48","999999=+Form44!D49","999999=+Form44!D50","999999=+Form44!D51","999999=+Form44!D52","999999=+Form44!D53","999999=+Form44!D54","999999=+Form44!D55","999999=+Form44!D56","999999=+Form44!D57","999999=+Form44!D58","999999=+Form44!E47","999999=+Form44!E48","999999=+Form44!E49","999999=+Form44!E50","999999=+Form44!E51","999999=+Form44!E52","999999=+Form44!E53","999999=+Form44!E54","999999=+Form44!E55","999999=+Form44!E56","999999=+Form44!E57","999999=+Form44!E58","999999=+Form44!$C$60","999999=+Form44!C64","999999=+Form44!C65",null,"999999=+Form44!C66","999999=+Form44!C67","999999=+Form44!$E$67","999999=+Form44!C68","999999=+Form44!C69","999999=+Form44!E69","999999=+Form44!C70","999999=+Form44!C71","999999=+Form44!C72","999999=+Form44!C73","999999=+Form44!E73","999999=+Form44!C78","999999=+Form44!C79","999999=+Form44!C80","999999=+Form44!D78","999999=+Form44!D79","999999=+Form44!D80","999999=+Form44!E78","999999=+Form44!E79","999999=+Form44!E80","999999=+Form44!C82","999999=+Form44!C95","999999=+Form44!D95","999999=+Form44!C96","999999=+Form44!D96","999999=+Form44!C97","999999=+Form44!D97","999999=+Form44!D98","999999=+Form44!D99",0,"999999=+Form44!D100","999999=+Form44!E95","999999=+Form44!F95","999999=+Form44!E96","999999=+Form44!F96","999999=+Form44!E97","999999=+Form44!F97","999999=+Form44!F98","999999=+Form44!F99",0,"999999=+Form44!F100","999999=+Form44!G95","999999=+Form44!H95","999999=+Form44!G96","999999=+Form44!H96","999999=+Form44!G97","999999=+Form44!H97","999999=+Form44!H98","999999=+Form44!H99",0,"999999=+Form44!H100","999999=+Form44!C105","999999=+Form44!D105","999999=+Form44!C106","999999=+Form44!D106","999999=+Form44!C107","999999=+Form44!D107","999999=+Form44!D108","999999=+Form44!D109",0,"999999=+Form44!D110","999999=+Form44!E105","999999=+Form44!F105","999999=+Form44!E106","999999=+Form44!F106","999999=+Form44!E107","999999=+Form44!F107","999999=+Form44!F108","999999=+Form44!F109",0,"999999=+Form44!F110","999999=+Form44!G105","999999=+Form44!H105","999999=+Form44!G106","999999=+Form44!H106","999999=+Form44!G107","999999=+Form44!H107","999999=+Form44!H108","999999=+Form44!H109",0,"999999=+Form44!H110","999999=+Form44!J105","999999=+Form44!J106","999999=+Form44!C123",null,"999999=+Form44!D123","999999=+Form44!C124","999999=+Form44!C125","999999=+Form44!C126","999999=+Form44!C127","999999=+Form44!C129","Non-Divested"]
[45,"999999=+MID(CELL(\"filename\",A1),FIND(\"[\",CELL(\"filename\",A1))+1,FIND(\"]\", CELL(\"filename\",A1))-FIND(\"[\",CELL(\"filename\",A1))-1)",null,null,"999999=+Form45!E5",45,"999999=+Form45!C7",null,"999999=+Form45!C8","999999=+Form45!C9","999999=+Form45!C10","999999=+Form45!C11","999999=+Form45!E11","999999=+Form45!F11","999999=+Form45!C12","999999=+Form45!C16","999999=+Form45!C17","999999=+Form45!E17","999999=+Form45!F17","999999=+Form45!C18","999999=+Form45!F18","999999=+Form45!C19","999999=+Form45!C20","999999=+Form45!E20","999999=+Form45!C24","999999=+Form45!C25","999999=+Form45!C26","999999=+Form45!F26","999999=+Form45!C27","999999=+Form45!C28","999999=+Form45!E28","999999=+Form45!F28","999999=+Form45!C29","999999=+Form45!C30","999999=+Form45!C31","999999=+Form45!C32","999999=+Form45!C33","999999=+Form45!C37",null,"999999=+Form45!C38",null,"999999=+Form45!C39",null,"999999=+Form45!C40",null,"999999=+Form45!C41","999999=+Form45!C47","999999=+Form45!C48","999999=+Form45!C49","999999=+Form45!C50","999999=+Form45!C51","999999=+Form45!C52","999999=+Form45!C53","999999=+Form45!C54","999999=+Form45!C55","999999=+Form45!C56","999999=+Form45!C57","999999=+Form45!C58","999999=+Form45!D47","999999=+Form45!D48","999999=+Form45!D49","999999=+Form45!D50","999999=+Form45!D51","999999=+Form45!D52","999999=+Form45!D53","999999=+Form45!D54","999999=+Form45!D55","999999=+Form45!D56","999999=+Form45!D57","999999=+Form45!D58","999999=+Form45!E47","999999=+Form45!E48","999999=+Form45!E49","999999=+Form45!E50","999999=+Form45!E51","999999=+Form45!E52","999999=+Form45!E53","999999=+Form45!E54","999999=+Form45!E55","999999=+Form45!E56","999999=+Form45!E57","999999=+Form45!E58","999999=+Form45!$C$60","999999=+Form45!C64","999999=+Form45!C65",null,"999999=+Form45!C66","999999=+Form45!C67","999999=+Form45!$E$67","999999=+Form45!C68","999999=+Form45!C69","999999=+Form45!E69","999999=+Form45!C70","999999=+Form45!C71","999999=+Form45!C72","999999=+Form45!C73","999999=+Form45!E73","999999=+Form45!C78","999999=+Form45!C79","999999=+Form45!C80","999999=+Form45!D78","999999=+Form45!D79","999999=+Form45!D80","999999=+Form45!E78","999999=+Form45!E79","999999=+Form45!E80","999999=+Form45!C82","999999=+Form45!C95","999999=+Form45!D95","999999=+Form45!C96","999999=+Form45!D96","999999=+Form45!C97","999999=+Form45!D97","999999=+Form45!D98","999999=+Form45!D99",0,"999999=+Form45!D100","999999=+Form45!E95","999999=+Form45!F95","999999=+Form45!E96","999999=+Form45!F96","999999=+Form45!E97","999999=+Form45!F97","999999=+Form45!F98","999999=+Form45!F99",0,"999999=+Form45!F100","999999=+Form45!G95","999999=+Form45!H95","999999=+Form45!G96","999999=+Form45!H96","999999=+Form45!G97","999999=+Form45!H97","999999=+Form45!H98","999999=+Form45!H99",0,"999999=+Form45!H100","999999=+Form45!C105","999999=+Form45!D105","999999=+Form45!C106","999999=+Form45!D106","999999=+Form45!C107","999999=+Form45!D107","999999=+Form45!D108","999999=+Form45!D109",0,"999999=+Form45!D110","999999=+Form45!E105","999999=+Form45!F105","999999=+Form45!E106","999999=+Form45!F106","999999=+Form45!E107","999999=+Form45!F107","999999=+Form45!F108","999999=+Form45!F109",0,"999999=+Form45!F110","999999=+Form45!G105","999999=+Form45!H105","999999=+Form45!G106","999999=+Form45!H106","999999=+Form45!G107","999999=+Form45!H107","999999=+Form45!H108","999999=+Form45!H109",0,"999999=+Form45!H110","999999=+Form45!J105","999999=+Form45!J106","999999=+Form45!C123",null,"999999=+Form45!D123","999999=+Form45!C124","999999=+Form45!C125","999999=+Form45!C126","999999=+Form45!C127","999999=+Form45!C129","Non-Divested"]
[46,"999999=+MID(CELL(\"filename\",A1),FIND(\"[\",CELL(\"filename\",A1))+1,FIND(\"]\", CELL(\"filename\",A1))-FIND(\"[\",CELL(\"filename\",A1))-1)",null,null,"999999=+Form46!E5",46,"999999=+Form46!C7",null,"999999=+Form46!C8","999999=+Form46!C9","999999=+Form46!C10","999999=+Form46!C11","999999=+Form46!E11","999999=+Form46!F11","999999=+Form46!C12","999999=+Form46!C16","999999=+Form46!C17","999999=+Form46!E17","999999=+Form46!F17","999999=+Form46!C18","999999=+Form46!F18","999999=+Form46!C19","999999=+Form46!C20","999999=+Form46!E20","999999=+Form46!C24","999999=+Form46!C25","999999=+Form46!C26","999999=+Form46!F26","999999=+Form46!C27","999999=+Form46!C28","999999=+Form46!E28","999999=+Form46!F28","999999=+Form46!C29","999999=+Form46!C30","999999=+Form46!C31","999999=+Form46!C32","999999=+Form46!C33","999999=+Form46!C37",null,"999999=+Form46!C38",null,"999999=+Form46!C39",null,"999999=+Form46!C40",null,"999999=+Form46!C41","999999=+Form46!C47","999999=+Form46!C48","999999=+Form46!C49","999999=+Form46!C50","999999=+Form46!C51","999999=+Form46!C52","999999=+Form46!C53","999999=+Form46!C54","999999=+Form46!C55","999999=+Form46!C56","999999=+Form46!C57","999999=+Form46!C58","999999=+Form46!D47","999999=+Form46!D48","999999=+Form46!D49","999999=+Form46!D50","999999=+Form46!D51","999999=+Form46!D52","999999=+Form46!D53","999999=+Form46!D54","999999=+Form46!D55","999999=+Form46!D56","999999=+Form46!D57","999999=+Form46!D58","999999=+Form46!E47","999999=+Form46!E48","999999=+Form46!E49","999999=+Form46!E50","999999=+Form46!E51","999999=+Form46!E52","999999=+Form46!E53","999999=+Form46!E54","999999=+Form46!E55","999999=+Form46!E56","999999=+Form46!E57","999999=+Form46!E58","999999=+Form46!$C$60","999999=+Form46!C64","999999=+Form46!C65",null,"999999=+Form46!C66","999999=+Form46!C67","999999=+Form46!$E$67","999999=+Form46!C68","999999=+Form46!C69","999999=+Form46!E69","999999=+Form46!C70","999999=+Form46!C71","999999=+Form46!C72","999999=+Form46!C73","999999=+Form46!E73","999999=+Form46!C78","999999=+Form46!C79","999999=+Form46!C80","999999=+Form46!D78","999999=+Form46!D79","999999=+Form46!D80","999999=+Form46!E78","999999=+Form46!E79","999999=+Form46!E80","999999=+Form46!C82","999999=+Form46!C95","999999=+Form46!D95","999999=+Form46!C96","999999=+Form46!D96","999999=+Form46!C97","999999=+Form46!D97","999999=+Form46!D98","999999=+Form46!D99",0,"999999=+Form46!D100","999999=+Form46!E95","999999=+Form46!F95","999999=+Form46!E96","999999=+Form46!F96","999999=+Form46!E97","999999=+Form46!F97","999999=+Form46!F98","999999=+Form46!F99",0,"999999=+Form46!F100","999999=+Form46!G95","999999=+Form46!H95","999999=+Form46!G96","999999=+Form46!H96","999999=+Form46!G97","999999=+Form46!H97","999999=+Form46!H98","999999=+Form46!H99",0,"999999=+Form46!H100","999999=+Form46!C105","999999=+Form46!D105","999999=+Form46!C106","999999=+Form46!D106","999999=+Form46!C107","999999=+Form46!D107","999999=+Form46!D108","999999=+Form46!D109",0,"999999=+Form46!D110","999999=+Form46!E105","999999=+Form46!F105","999999=+Form46!E106","999999=+Form46!F106","999999=+Form46!E107","999999=+Form46!F107","999999=+Form46!F108","999999=+Form46!F109",0,"999999=+Form46!F110","999999=+Form46!G105","999999=+Form46!H105","999999=+Form46!G106","999999=+Form46!H106","999999=+Form46!G107","999999=+Form46!H107","999999=+Form46!H108","999999=+Form46!H109",0,"999999=+Form46!H110","999999=+Form46!J105","999999=+Form46!J106","999999=+Form46!C123",null,"999999=+Form46!D123","999999=+Form46!C124","999999=+Form46!C125","999999=+Form46!C126","999999=+Form46!C127","999999=+Form46!C129","Non-Divested"]
[47,"999999=+MID(CELL(\"filename\",A1),FIND(\"[\",CELL(\"filename\",A1))+1,FIND(\"]\", CELL(\"filename\",A1))-FIND(\"[\",CELL(\"filename\",A1))-1)",null,null,"999999=+Form47!E5",47,"999999=+Form47!C7",null,"999999=+Form47!C8","999999=+Form47!C9","999999=+Form47!C10","999999=+Form47!C11","999999=+Form47!E11","999999=+Form47!F11","999999=+Form47!C12","999999=+Form47!C16","999999=+Form47!C17","999999=+Form47!E17","999999=+Form47!F17","999999=+Form47!C18","999999=+Form47!F18","999999=+Form47!C19","999999=+Form47!C20","999999=+Form47!E20","999999=+Form47!C24","999999=+Form47!C25","999999=+Form47!C26","999999=+Form47!F26","999999=+Form47!C27","999999=+Form47!C28","999999=+Form47!E28","999999=+Form47!F28","999999=+Form47!C29","999999=+Form47!C30","999999=+Form47!C31","999999=+Form47!C32","999999=+Form47!C33","999999=+Form47!C37",null,"999999=+Form47!C38",null,"999999=+Form47!C39",null,"999999=+Form47!C40",null,"999999=+Form47!C41","999999=+Form47!C47","999999=+Form47!C48","999999=+Form47!C49","999999=+Form47!C50","999999=+Form47!C51","999999=+Form47!C52","999999=+Form47!C53","999999=+Form47!C54","999999=+Form47!C55","999999=+Form47!C56","999999=+Form47!C57","999999=+Form47!C58","999999=+Form47!D47","999999=+Form47!D48","999999=+Form47!D49","999999=+Form47!D50","999999=+Form47!D51","999999=+Form47!D52","999999=+Form47!D53","999999=+Form47!D54","999999=+Form47!D55","999999=+Form47!D56","999999=+Form47!D57","999999=+Form47!D58","999999=+Form47!E47","999999=+Form47!E48","999999=+Form47!E49","999999=+Form47!E50","999999=+Form47!E51","999999=+Form47!E52","999999=+Form47!E53","999999=+Form47!E54","999999=+Form47!E55","999999=+Form47!E56","999999=+Form47!E57","999999=+Form47!E58","999999=+Form47!$C$60","999999=+Form47!C64","999999=+Form47!C65",null,"999999=+Form47!C66","999999=+Form47!C67","999999=+Form47!$E$67","999999=+Form47!C68","999999=+Form47!C69","999999=+Form47!E69","999999=+Form47!C70","999999=+Form47!C71","999999=+Form47!C72","999999=+Form47!C73","999999=+Form47!E73","999999=+Form47!C78","999999=+Form47!C79","999999=+Form47!C80","999999=+Form47!D78","999999=+Form47!D79","999999=+Form47!D80","999999=+Form47!E78","999999=+Form47!E79","999999=+Form47!E80","999999=+Form47!C82","999999=+Form47!C95","999999=+Form47!D95","999999=+Form47!C96","999999=+Form47!D96","999999=+Form47!C97","999999=+Form47!D97","999999=+Form47!D98","999999=+Form47!D99",0,"999999=+Form47!D100","999999=+Form47!E95","999999=+Form47!F95","999999=+Form47!E96","999999=+Form47!F96","999999=+Form47!E97","999999=+Form47!F97","999999=+Form47!F98","999999=+Form47!F99",0,"999999=+Form47!F100","999999=+Form47!G95","999999=+Form47!H95","999999=+Form47!G96","999999=+Form47!H96","999999=+Form47!G97","999999=+Form47!H97","999999=+Form47!H98","999999=+Form47!H99",0,"999999=+Form47!H100","999999=+Form47!C105","999999=+Form47!D105","999999=+Form47!C106","999999=+Form47!D106","999999=+Form47!C107","999999=+Form47!D107","999999=+Form47!D108","999999=+Form47!D109",0,"999999=+Form47!D110","999999=+Form47!E105","999999=+Form47!F105","999999=+Form47!E106","999999=+Form47!F106","999999=+Form47!E107","999999=+Form47!F107","999999=+Form47!F108","999999=+Form47!F109",0,"999999=+Form47!F110","999999=+Form47!G105","999999=+Form47!H105","999999=+Form47!G106","999999=+Form47!H106","999999=+Form47!G107","999999=+Form47!H107","999999=+Form47!H108","999999=+Form47!H109",0,"999999=+Form47!H110","999999=+Form47!J105","999999=+Form47!J106","999999=+Form47!C123",null,"999999=+Form47!D123","999999=+Form47!C124","999999=+Form47!C125","999999=+Form47!C126","999999=+Form47!C127","999999=+Form47!C129","Non-Divested"]
[48,"999999=+MID(CELL(\"filename\",A1),FIND(\"[\",CELL(\"filename\",A1))+1,FIND(\"]\", CELL(\"filename\",A1))-FIND(\"[\",CELL(\"filename\",A1))-1)",null,null,"999999=+Form48!E5",48,"999999=+Form48!C7",null,"999999=+Form48!C8","999999=+Form48!C9","999999=+Form48!C10","999999=+Form48!C11","999999=+Form48!E11","999999=+Form48!F11","999999=+Form48!C12","999999=+Form48!C16","999999=+Form48!C17","999999=+Form48!E17","999999=+Form48!F17","999999=+Form48!C18","999999=+Form48!F18","999999=+Form48!C19","999999=+Form48!C20","999999=+Form48!E20","999999=+Form48!C24","999999=+Form48!C25","999999=+Form48!C26","999999=+Form48!F26","999999=+Form48!C27","999999=+Form48!C28","999999=+Form48!E28","999999=+Form48!F28","999999=+Form48!C29","999999=+Form48!C30","999999=+Form48!C31","999999=+Form48!C32","999999=+Form48!C33","999999=+Form48!C37",null,"999999=+Form48!C38",null,"999999=+Form48!C39",null,"999999=+Form48!C40",null,"999999=+Form48!C41","999999=+Form48!C47","999999=+Form48!C48","999999=+Form48!C49","999999=+Form48!C50","999999=+Form48!C51","999999=+Form48!C52","999999=+Form48!C53","999999=+Form48!C54","999999=+Form48!C55","999999=+Form48!C56","999999=+Form48!C57","999999=+Form48!C58","999999=+Form48!D47","999999=+Form48!D48","999999=+Form48!D49","999999=+Form48!D50","999999=+Form48!D51","999999=+Form48!D52","999999=+Form48!D53","999999=+Form48!D54","999999=+Form48!D55","999999=+Form48!D56","999999=+Form48!D57","999999=+Form48!D58","999999=+Form48!E47","999999=+Form48!E48","999999=+Form48!E49","999999=+Form48!E50","999999=+Form48!E51","999999=+Form48!E52","999999=+Form48!E53","999999=+Form48!E54","999999=+Form48!E55","999999=+Form48!E56","999999=+Form48!E57","999999=+Form48!E58","999999=+Form48!$C$60","999999=+Form48!C64","999999=+Form48!C65",null,"999999=+Form48!C66","999999=+Form48!C67","999999=+Form48!$E$67","999999=+Form48!C68","999999=+Form48!C69","999999=+Form48!E69","999999=+Form48!C70","999999=+Form48!C71","999999=+Form48!C72","999999=+Form48!C73","999999=+Form48!E73","999999=+Form48!C78","999999=+Form48!C79","999999=+Form48!C80","999999=+Form48!D78","999999=+Form48!D79","999999=+Form48!D80","999999=+Form48!E78","999999=+Form48!E79","999999=+Form48!E80","999999=+Form48!C82","999999=+Form48!C95","999999=+Form48!D95","999999=+Form48!C96","999999=+Form48!D96","999999=+Form48!C97","999999=+Form48!D97","999999=+Form48!D98","999999=+Form48!D99",0,"999999=+Form48!D100","999999=+Form48!E95","999999=+Form48!F95","999999=+Form48!E96","999999=+Form48!F96","999999=+Form48!E97","999999=+Form48!F97","999999=+Form48!F98","999999=+Form48!F99",0,"999999=+Form48!F100","999999=+Form48!G95","999999=+Form48!H95","999999=+Form48!G96","999999=+Form48!H96","999999=+Form48!G97","999999=+Form48!H97","999999=+Form48!H98","999999=+Form48!H99",0,"999999=+Form48!H100","999999=+Form48!C105","999999=+Form48!D105","999999=+Form48!C106","999999=+Form48!D106","999999=+Form48!C107","999999=+Form48!D107","999999=+Form48!D108","999999=+Form48!D109",0,"999999=+Form48!D110","999999=+Form48!E105","999999=+Form48!F105","999999=+Form48!E106","999999=+Form48!F106","999999=+Form48!E107","999999=+Form48!F107","999999=+Form48!F108","999999=+Form48!F109",0,"999999=+Form48!F110","999999=+Form48!G105","999999=+Form48!H105","999999=+Form48!G106","999999=+Form48!H106","999999=+Form48!G107","999999=+Form48!H107","999999=+Form48!H108","999999=+Form48!H109",0,"999999=+Form48!H110","999999=+Form48!J105","999999=+Form48!J106","999999=+Form48!C123",null,"999999=+Form48!D123","999999=+Form48!C124","999999=+Form48!C125","999999=+Form48!C126","999999=+Form48!C127","999999=+Form48!C129","Non-Divested"]
[49,"999999=+MID(CELL(\"filename\",A1),FIND(\"[\",CELL(\"filename\",A1))+1,FIND(\"]\", CELL(\"filename\",A1))-FIND(\"[\",CELL(\"filename\",A1))-1)",null,null,"999999=+Form49!E5",49,"999999=+Form49!C7",null,"999999=+Form49!C8","999999=+Form49!C9","999999=+Form49!C10","999999=+Form49!C11","999999=+Form49!E11","999999=+Form49!F11","999999=+Form49!C12","999999=+Form49!C16","999999=+Form49!C17","999999=+Form49!E17","999999=+Form49!F17","999999=+Form49!C18","999999=+Form49!F18","999999=+Form49!C19","999999=+Form49!C20","999999=+Form49!E20","999999=+Form49!C24","999999=+Form49!C25","999999=+Form49!C26","999999=+Form49!F26","999999=+Form49!C27","999999=+Form49!C28","999999=+Form49!E28","999999=+Form49!F28","999999=+Form49!C29","999999=+Form49!C30","999999=+Form49!C31","999999=+Form49!C32","999999=+Form49!C33","999999=+Form49!C37",null,"999999=+Form49!C38",null,"999999=+Form49!C39",null,"999999=+Form49!C40",null,"999999=+Form49!C41","999999=+Form49!C47","999999=+Form49!C48","999999=+Form49!C49","999999=+Form49!C50","999999=+Form49!C51","999999=+Form49!C52","999999=+Form49!C53","999999=+Form49!C54","999999=+Form49!C55","999999=+Form49!C56","999999=+Form49!C57","999999=+Form49!C58","999999=+Form49!D47","999999=+Form49!D48","999999=+Form49!D49","999999=+Form49!D50","999999=+Form49!D51","999999=+Form49!D52","999999=+Form49!D53","999999=+Form49!D54","999999=+Form49!D55","999999=+Form49!D56","999999=+Form49!D57","999999=+Form49!D58","999999=+Form49!E47","999999=+Form49!E48","999999=+Form49!E49","999999=+Form49!E50","999999=+Form49!E51","999999=+Form49!E52","999999=+Form49!E53","999999=+Form49!E54","999999=+Form49!E55","999999=+Form49!E56","999999=+Form49!E57","999999=+Form49!E58","999999=+Form49!$C$60","999999=+Form49!C64","999999=+Form49!C65",null,"999999=+Form49!C66","999999=+Form49!C67","999999=+Form49!$E$67","999999=+Form49!C68","999999=+Form49!C69","999999=+Form49!E69","999999=+Form49!C70","999999=+Form49!C71","999999=+Form49!C72","999999=+Form49!C73","999999=+Form49!E73","999999=+Form49!C78","999999=+Form49!C79","999999=+Form49!C80","999999=+Form49!D78","999999=+Form49!D79","999999=+Form49!D80","999999=+Form49!E78","999999=+Form49!E79","999999=+Form49!E80","999999=+Form49!C82","999999=+Form49!C95","999999=+Form49!D95","999999=+Form49!C96","999999=+Form49!D96","999999=+Form49!C97","999999=+Form49!D97","999999=+Form49!D98","999999=+Form49!D99",0,"999999=+Form49!D100","999999=+Form49!E95","999999=+Form49!F95","999999=+Form49!E96","999999=+Form49!F96","999999=+Form49!E97","999999=+Form49!F97","999999=+Form49!F98","999999=+Form49!F99",0,"999999=+Form49!F100","999999=+Form49!G95","999999=+Form49!H95","999999=+Form49!G96","999999=+Form49!H96","999999=+Form49!G97","999999=+Form49!H97","999999=+Form49!H98","999999=+Form49!H99",0,"999999=+Form49!H100","999999=+Form49!C105","999999=+Form49!D105","999999=+Form49!C106","999999=+Form49!D106","999999=+Form49!C107","999999=+Form49!D107","999999=+Form49!D108","999999=+Form49!D109",0,"999999=+Form49!D110","999999=+Form49!E105","999999=+Form49!F105","999999=+Form49!E106","999999=+Form49!F106","999999=+Form49!E107","999999=+Form49!F107","999999=+Form49!F108","999999=+Form49!F109",0,"999999=+Form49!F110","999999=+Form49!G105","999999=+Form49!H105","999999=+Form49!G106","999999=+Form49!H106","999999=+Form49!G107","999999=+Form49!H107","999999=+Form49!H108","999999=+Form49!H109",0,"999999=+Form49!H110","999999=+Form49!J105","999999=+Form49!J106","999999=+Form49!C123",null,"999999=+Form49!D123","999999=+Form49!C124","999999=+Form49!C125","999999=+Form49!C126","999999=+Form49!C127","999999=+Form49!C129","Non-Divested"]
[50,"999999=+MID(CELL(\"filename\",A1),FIND(\"[\",CELL(\"filename\",A1))+1,FIND(\"]\", CELL(\"filename\",A1))-FIND(\"[\",CELL(\"filename\",A1))-1)",null,null,"999999=+Form50!E5",50,"999999=+Form50!C7",null,"999999=+Form50!C8","999999=+Form50!C9","999999=+Form50!C10","999999=+Form50!C11","999999=+Form50!E11","999999=+Form50!F11","999999=+Form50!C12","999999=+Form50!C16","999999=+Form50!C17","999999=+Form50!E17","999999=+Form50!F17","999999=+Form50!C18","999999=+Form50!F18","999999=+Form50!C19","999999=+Form50!C20","999999=+Form50!E20","999999=+Form50!C24","999999=+Form50!C25","999999=+Form50!C26","999999=+Form50!F26","999999=+Form50!C27","999999=+Form50!C28","999999=+Form50!E28","999999=+Form50!F28","999999=+Form50!C29","999999=+Form50!C30","999999=+Form50!C31","999999=+Form50!C32","999999=+Form50!C33","999999=+Form50!C37",null,"999999=+Form50!C38",null,"999999=+Form50!C39",null,"999999=+Form50!C40",null,"999999=+Form50!C41","999999=+Form50!C47","999999=+Form50!C48","999999=+Form50!C49","999999=+Form50!C50","999999=+Form50!C51","999999=+Form50!C52","999999=+Form50!C53","999999=+Form50!C54","999999=+Form50!C55","999999=+Form50!C56","999999=+Form50!C57","999999=+Form50!C58","999999=+Form50!D47","999999=+Form50!D48","999999=+Form50!D49","999999=+Form50!D50","999999=+Form50!D51","999999=+Form50!D52","999999=+Form50!D53","999999=+Form50!D54","999999=+Form50!D55","999999=+Form50!D56","999999=+Form50!D57","999999=+Form50!D58","999999=+Form50!E47","999999=+Form50!E48","999999=+Form50!E49","999999=+Form50!E50","999999=+Form50!E51","999999=+Form50!E52","999999=+Form50!E53","999999=+Form50!E54","999999=+Form50!E55","999999=+Form50!E56","999999=+Form50!E57","999999=+Form50!E58","999999=+Form50!$C$60","999999=+Form50!C64","999999=+Form50!C65",null,"999999=+Form50!C66","999999=+Form50!C67","999999=+Form50!$E$67","999999=+Form50!C68","999999=+Form50!C69","999999=+Form50!E69","999999=+Form50!C70","999999=+Form50!C71","999999=+Form50!C72","999999=+Form50!C73","999999=+Form50!E73","999999=+Form50!C78","999999=+Form50!C79","999999=+Form50!C80","999999=+Form50!D78","999999=+Form50!D79","999999=+Form50!D80","999999=+Form50!E78","999999=+Form50!E79","999999=+Form50!E80","999999=+Form50!C82","999999=+Form50!C95","999999=+Form50!D95","999999=+Form50!C96","999999=+Form50!D96","999999=+Form50!C97","999999=+Form50!D97","999999=+Form50!D98","999999=+Form50!D99",0,"999999=+Form50!D100","999999=+Form50!E95","999999=+Form50!F95","999999=+Form50!E96","999999=+Form50!F96","999999=+Form50!E97","999999=+Form50!F97","999999=+Form50!F98","999999=+Form50!F99",0,"999999=+Form50!F100","999999=+Form50!G95","999999=+Form50!H95","999999=+Form50!G96","999999=+Form50!H96","999999=+Form50!G97","999999=+Form50!H97","999999=+Form50!H98","999999=+Form50!H99",0,"999999=+Form50!H100","999999=+Form50!C105","999999=+Form50!D105","999999=+Form50!C106","999999=+Form50!D106","999999=+Form50!C107","999999=+Form50!D107","999999=+Form50!D108","999999=+Form50!D109",0,"999999=+Form50!D110","999999=+Form50!E105","999999=+Form50!F105","999999=+Form50!E106","999999=+Form50!F106","999999=+Form50!E107","999999=+Form50!F107","999999=+Form50!F108","999999=+Form50!F109",0,"999999=+Form50!F110","999999=+Form50!G105","999999=+Form50!H105","999999=+Form50!G106","999999=+Form50!H106","999999=+Form50!G107","999999=+Form50!H107","999999=+Form50!H108","999999=+Form50!H109",0,"999999=+Form50!H110","999999=+Form50!J105","999999=+Form50!J106","999999=+Form50!C123",null,"999999=+Form50!D123","999999=+Form50!C124","999999=+Form50!C125","999999=+Form50!C126","999999=+Form50!C127","999999=+Form50!C129","Non-Divested"]
[51,"999999=+MID(CELL(\"filename\",A1),FIND(\"[\",CELL(\"filename\",A1))+1,FIND(\"]\", CELL(\"filename\",A1))-FIND(\"[\",CELL(\"filename\",A1))-1)",null,null,"999999=+Form51!E5",51,"999999=+Form51!C7",null,"999999=+Form51!C8","999999=+Form51!C9","999999=+Form51!C10","999999=+Form51!C11","999999=+Form51!E11","999999=+Form51!F11","999999=+Form51!C12","999999=+Form51!C16","999999=+Form51!C17","999999=+Form51!E17","999999=+Form51!F17","999999=+Form51!C18","999999=+Form51!F18","999999=+Form51!C19","999999=+Form51!C20","999999=+Form51!E20","999999=+Form51!C24","999999=+Form51!C25","999999=+Form51!C26","999999=+Form51!F26","999999=+Form51!C27","999999=+Form51!C28","999999=+Form51!E28","999999=+Form51!F28","999999=+Form51!C29","999999=+Form51!C30","999999=+Form51!C31","999999=+Form51!C32","999999=+Form51!C33","999999=+Form51!C37",null,"999999=+Form51!C38",null,"999999=+Form51!C39",null,"999999=+Form51!C40",null,"999999=+Form51!C41","999999=+Form51!C47","999999=+Form51!C48","999999=+Form51!C49","999999=+Form51!C50","999999=+Form51!C51","999999=+Form51!C52","999999=+Form51!C53","999999=+Form51!C54","999999=+Form51!C55","999999=+Form51!C56","999999=+Form51!C57","999999=+Form51!C58","999999=+Form51!D47","999999=+Form51!D48","999999=+Form51!D49","999999=+Form51!D50","999999=+Form51!D51","999999=+Form51!D52","999999=+Form51!D53","999999=+Form51!D54","999999=+Form51!D55","999999=+Form51!D56","999999=+Form51!D57","999999=+Form51!D58","999999=+Form51!E47","999999=+Form51!E48","999999=+Form51!E49","999999=+Form51!E50","999999=+Form51!E51","999999=+Form51!E52","999999=+Form51!E53","999999=+Form51!E54","999999=+Form51!E55","999999=+Form51!E56","999999=+Form51!E57","999999=+Form51!E58","999999=+Form51!$C$60","999999=+Form51!C64","999999=+Form51!C65",null,"999999=+Form51!C66","999999=+Form51!C67","999999=+Form51!$E$67","999999=+Form51!C68","999999=+Form51!C69","999999=+Form51!E69","999999=+Form51!C70","999999=+Form51!C71","999999=+Form51!C72","999999=+Form51!C73","999999=+Form51!E73","999999=+Form51!C78","999999=+Form51!C79","999999=+Form51!C80","999999=+Form51!D78","999999=+Form51!D79","999999=+Form51!D80","999999=+Form51!E78","999999=+Form51!E79","999999=+Form51!E80","999999=+Form51!C82","999999=+Form51!C95","999999=+Form51!D95","999999=+Form51!C96","999999=+Form51!D96","999999=+Form51!C97","999999=+Form51!D97","999999=+Form51!D98","999999=+Form51!D99",0,"999999=+Form51!D100","999999=+Form51!E95","999999=+Form51!F95","999999=+Form51!E96","999999=+Form51!F96","999999=+Form51!E97","999999=+Form51!F97","999999=+Form51!F98","999999=+Form51!F99",0,"999999=+Form51!F100","999999=+Form51!G95","999999=+Form51!H95","999999=+Form51!G96","999999=+Form51!H96","999999=+Form51!G97","999999=+Form51!H97","999999=+Form51!H98","999999=+Form51!H99",0,"999999=+Form51!H100","999999=+Form51!C105","999999=+Form51!D105","999999=+Form51!C106","999999=+Form51!D106","999999=+Form51!C107","999999=+Form51!D107","999999=+Form51!D108","999999=+Form51!D109",0,"999999=+Form51!D110","999999=+Form51!E105","999999=+Form51!F105","999999=+Form51!E106","999999=+Form51!F106","999999=+Form51!E107","999999=+Form51!F107","999999=+Form51!F108","999999=+Form51!F109",0,"999999=+Form51!F110","999999=+Form51!G105","999999=+Form51!H105","999999=+Form51!G106","999999=+Form51!H106","999999=+Form51!G107","999999=+Form51!H107","999999=+Form51!H108","999999=+Form51!H109",0,"999999=+Form51!H110","999999=+Form51!J105","999999=+Form51!J106","999999=+Form51!C123",null,"999999=+Form51!D123","999999=+Form51!C124","999999=+Form51!C125","999999=+Form51!C126","999999=+Form51!C127","999999=+Form51!C129","Non-Divested"]
[52,"999999=+MID(CELL(\"filename\",A1),FIND(\"[\",CELL(\"filename\",A1))+1,FIND(\"]\", CELL(\"filename\",A1))-FIND(\"[\",CELL(\"filename\",A1))-1)",null,null,"999999=+Form52!E5",52,"999999=+Form52!C7",null,"999999=+Form52!C8","999999=+Form52!C9","999999=+Form52!C10","999999=+Form52!C11","999999=+Form52!E11","999999=+Form52!F11","999999=+Form52!C12","999999=+Form52!C16","999999=+Form52!C17","999999=+Form52!E17","999999=+Form52!F17","999999=+Form52!C18","999999=+Form52!F18","999999=+Form52!C19","999999=+Form52!C20","999999=+Form52!E20","999999=+Form52!C24","999999=+Form52!C25","999999=+Form52!C26","999999=+Form52!F26","999999=+Form52!C27","999999=+Form52!C28","999999=+Form52!E28","999999=+Form52!F28","999999=+Form52!C29","999999=+Form52!C30","999999=+Form52!C31","999999=+Form52!C32","999999=+Form52!C33","999999=+Form52!C37",null,"999999=+Form52!C38",null,"999999=+Form52!C39",null,"999999=+Form52!C40",null,"999999=+Form52!C41","999999=+Form52!C47","999999=+Form52!C48","999999=+Form52!C49","999999=+Form52!C50","999999=+Form52!C51","999999=+Form52!C52","999999=+Form52!C53","999999=+Form52!C54","999999=+Form52!C55","999999=+Form52!C56","999999=+Form52!C57","999999=+Form52!C58","999999=+Form52!D47","999999=+Form52!D48","999999=+Form52!D49","999999=+Form52!D50","999999=+Form52!D51","999999=+Form52!D52","999999=+Form52!D53","999999=+Form52!D54","999999=+Form52!D55","999999=+Form52!D56","999999=+Form52!D57","999999=+Form52!D58","999999=+Form52!E47","999999=+Form52!E48","999999=+Form52!E49","999999=+Form52!E50","999999=+Form52!E51","999999=+Form52!E52","999999=+Form52!E53","999999=+Form52!E54","999999=+Form52!E55","999999=+Form52!E56","999999=+Form52!E57","999999=+Form52!E58","999999=+Form52!$C$60","999999=+Form52!C64","999999=+Form52!C65",null,"999999=+Form52!C66","999999=+Form52!C67","999999=+Form52!$E$67","999999=+Form52!C68","999999=+Form52!C69","999999=+Form52!E69","999999=+Form52!C70","999999=+Form52!C71","999999=+Form52!C72","999999=+Form52!C73","999999=+Form52!E73","999999=+Form52!C78","999999=+Form52!C79","999999=+Form52!C80","999999=+Form52!D78","999999=+Form52!D79","999999=+Form52!D80","999999=+Form52!E78","999999=+Form52!E79","999999=+Form52!E80","999999=+Form52!C82","999999=+Form52!C95","999999=+Form52!D95","999999=+Form52!C96","999999=+Form52!D96","999999=+Form52!C97","999999=+Form52!D97","999999=+Form52!D98","999999=+Form52!D99",0,"999999=+Form52!D100","999999=+Form52!E95","999999=+Form52!F95","999999=+Form52!E96","999999=+Form52!F96","999999=+Form52!E97","999999=+Form52!F97","999999=+Form52!F98","999999=+Form52!F99",0,"999999=+Form52!F100","999999=+Form52!G95","999999=+Form52!H95","999999=+Form52!G96","999999=+Form52!H96","999999=+Form52!G97","999999=+Form52!H97","999999=+Form52!H98","999999=+Form52!H99",0,"999999=+Form52!H100","999999=+Form52!C105","999999=+Form52!D105","999999=+Form52!C106","999999=+Form52!D106","999999=+Form52!C107","999999=+Form52!D107","999999=+Form52!D108","999999=+Form52!D109",0,"999999=+Form52!D110","999999=+Form52!E105","999999=+Form52!F105","999999=+Form52!E106","999999=+Form52!F106","999999=+Form52!E107","999999=+Form52!F107","999999=+Form52!F108","999999=+Form52!F109",0,"999999=+Form52!F110","999999=+Form52!G105","999999=+Form52!H105","999999=+Form52!G106","999999=+Form52!H106","999999=+Form52!G107","999999=+Form52!H107","999999=+Form52!H108","999999=+Form52!H109",0,"999999=+Form52!H110","999999=+Form52!J105","999999=+Form52!J106","999999=+Form52!C123",null,"999999=+Form52!D123","999999=+Form52!C124","999999=+Form52!C125","999999=+Form52!C126","999999=+Form52!C127","999999=+Form52!C129","Non-Divested"]
[53,"999999=+MID(CELL(\"filename\",A1),FIND(\"[\",CELL(\"filename\",A1))+1,FIND(\"]\", CELL(\"filename\",A1))-FIND(\"[\",CELL(\"filename\",A1))-1)",null,null,"999999=+Form53!E5",53,"999999=+Form53!C7",null,"999999=+Form53!C8","999999=+Form53!C9","999999=+Form53!C10","999999=+Form53!C11","999999=+Form53!E11","999999=+Form53!F11","999999=+Form53!C12","999999=+Form53!C16","999999=+Form53!C17","999999=+Form53!E17","999999=+Form53!F17","999999=+Form53!C18","999999=+Form53!F18","999999=+Form53!C19","999999=+Form53!C20","999999=+Form53!E20","999999=+Form53!C24","999999=+Form53!C25","999999=+Form53!C26","999999=+Form53!F26","999999=+Form53!C27","999999=+Form53!C28","999999=+Form53!E28","999999=+Form53!F28","999999=+Form53!C29","999999=+Form53!C30","999999=+Form53!C31","999999=+Form53!C32","999999=+Form53!C33","999999=+Form53!C37",null,"999999=+Form53!C38",null,"999999=+Form53!C39",null,"999999=+Form53!C40",null,"999999=+Form53!C41","999999=+Form53!C47","999999=+Form53!C48","999999=+Form53!C49","999999=+Form53!C50","999999=+Form53!C51","999999=+Form53!C52","999999=+Form53!C53","999999=+Form53!C54","999999=+Form53!C55","999999=+Form53!C56","999999=+Form53!C57","999999=+Form53!C58","999999=+Form53!D47","999999=+Form53!D48","999999=+Form53!D49","999999=+Form53!D50","999999=+Form53!D51","999999=+Form53!D52","999999=+Form53!D53","999999=+Form53!D54","999999=+Form53!D55","999999=+Form53!D56","999999=+Form53!D57","999999=+Form53!D58","999999=+Form53!E47","999999=+Form53!E48","999999=+Form53!E49","999999=+Form53!E50","999999=+Form53!E51","999999=+Form53!E52","999999=+Form53!E53","999999=+Form53!E54","999999=+Form53!E55","999999=+Form53!E56","999999=+Form53!E57","999999=+Form53!E58","999999=+Form53!$C$60","999999=+Form53!C64","999999=+Form53!C65",null,"999999=+Form53!C66","999999=+Form53!C67","999999=+Form53!$E$67","999999=+Form53!C68","999999=+Form53!C69","999999=+Form53!E69","999999=+Form53!C70","999999=+Form53!C71","999999=+Form53!C72","999999=+Form53!C73","999999=+Form53!E73","999999=+Form53!C78","999999=+Form53!C79","999999=+Form53!C80","999999=+Form53!D78","999999=+Form53!D79","999999=+Form53!D80","999999=+Form53!E78","999999=+Form53!E79","999999=+Form53!E80","999999=+Form53!C82","999999=+Form53!C95","999999=+Form53!D95","999999=+Form53!C96","999999=+Form53!D96","999999=+Form53!C97","999999=+Form53!D97","999999=+Form53!D98","999999=+Form53!D99",0,"999999=+Form53!D100","999999=+Form53!E95","999999=+Form53!F95","999999=+Form53!E96","999999=+Form53!F96","999999=+Form53!E97","999999=+Form53!F97","999999=+Form53!F98","999999=+Form53!F99",0,"999999=+Form53!F100","999999=+Form53!G95","999999=+Form53!H95","999999=+Form53!G96","999999=+Form53!H96","999999=+Form53!G97","999999=+Form53!H97","999999=+Form53!H98","999999=+Form53!H99",0,"999999=+Form53!H100","999999=+Form53!C105","999999=+Form53!D105","999999=+Form53!C106","999999=+Form53!D106","999999=+Form53!C107","999999=+Form53!D107","999999=+Form53!D108","999999=+Form53!D109",0,"999999=+Form53!D110","999999=+Form53!E105","999999=+Form53!F105","999999=+Form53!E106","999999=+Form53!F106","999999=+Form53!E107","999999=+Form53!F107","999999=+Form53!F108","999999=+Form53!F109",0,"999999=+Form53!F110","999999=+Form53!G105","999999=+Form53!H105","999999=+Form53!G106","999999=+Form53!H106","999999=+Form53!G107","999999=+Form53!H107","999999=+Form53!H108","999999=+Form53!H109",0,"999999=+Form53!H110","999999=+Form53!J105","999999=+Form53!J106","999999=+Form53!C123",null,"999999=+Form53!D123","999999=+Form53!C124","999999=+Form53!C125","999999=+Form53!C126","999999=+Form53!C127","999999=+Form53!C129","Non-Divested"]
[54,"999999=+MID(CELL(\"filename\",A1),FIND(\"[\",CELL(\"filename\",A1))+1,FIND(\"]\", CELL(\"filename\",A1))-FIND(\"[\",CELL(\"filename\",A1))-1)",null,null,"999999=+Form54!E5",54,"999999=+Form54!C7",null,"999999=+Form54!C8","999999=+Form54!C9","999999=+Form54!C10","999999=+Form54!C11","999999=+Form54!E11","999999=+Form54!F11","999999=+Form54!C12","999999=+Form54!C16","999999=+Form54!C17","999999=+Form54!E17","999999=+Form54!F17","999999=+Form54!C18","999999=+Form54!F18","999999=+Form54!C19","999999=+Form54!C20","999999=+Form54!E20","999999=+Form54!C24","999999=+Form54!C25","999999=+Form54!C26","999999=+Form54!F26","999999=+Form54!C27","999999=+Form54!C28","999999=+Form54!E28","999999=+Form54!F28","999999=+Form54!C29","999999=+Form54!C30","999999=+Form54!C31","999999=+Form54!C32","999999=+Form54!C33","999999=+Form54!C37",null,"999999=+Form54!C38",null,"999999=+Form54!C39",null,"999999=+Form54!C40",null,"999999=+Form54!C41","999999=+Form54!C47","999999=+Form54!C48","999999=+Form54!C49","999999=+Form54!C50","999999=+Form54!C51","999999=+Form54!C52","999999=+Form54!C53","999999=+Form54!C54","999999=+Form54!C55","999999=+Form54!C56","999999=+Form54!C57","999999=+Form54!C58","999999=+Form54!D47","999999=+Form54!D48","999999=+Form54!D49","999999=+Form54!D50","999999=+Form54!D51","999999=+Form54!D52","999999=+Form54!D53","999999=+Form54!D54","999999=+Form54!D55","999999=+Form54!D56","999999=+Form54!D57","999999=+Form54!D58","999999=+Form54!E47","999999=+Form54!E48","999999=+Form54!E49","999999=+Form54!E50","999999=+Form54!E51","999999=+Form54!E52","999999=+Form54!E53","999999=+Form54!E54","999999=+Form54!E55","999999=+Form54!E56","999999=+Form54!E57","999999=+Form54!E58","999999=+Form54!$C$60","999999=+Form54!C64","999999=+Form54!C65",null,"999999=+Form54!C66","999999=+Form54!C67","999999=+Form54!$E$67","999999=+Form54!C68","999999=+Form54!C69","999999=+Form54!E69","999999=+Form54!C70","999999=+Form54!C71","999999=+Form54!C72","999999=+Form54!C73","999999=+Form54!E73","999999=+Form54!C78","999999=+Form54!C79","999999=+Form54!C80","999999=+Form54!D78","999999=+Form54!D79","999999=+Form54!D80","999999=+Form54!E78","999999=+Form54!E79","999999=+Form54!E80","999999=+Form54!C82","999999=+Form54!C95","999999=+Form54!D95","999999=+Form54!C96","999999=+Form54!D96","999999=+Form54!C97","999999=+Form54!D97","999999=+Form54!D98","999999=+Form54!D99",0,"999999=+Form54!D100","999999=+Form54!E95","999999=+Form54!F95","999999=+Form54!E96","999999=+Form54!F96","999999=+Form54!E97","999999=+Form54!F97","999999=+Form54!F98","999999=+Form54!F99",0,"999999=+Form54!F100","999999=+Form54!G95","999999=+Form54!H95","999999=+Form54!G96","999999=+Form54!H96","999999=+Form54!G97","999999=+Form54!H97","999999=+Form54!H98","999999=+Form54!H99",0,"999999=+Form54!H100","999999=+Form54!C105","999999=+Form54!D105","999999=+Form54!C106","999999=+Form54!D106","999999=+Form54!C107","999999=+Form54!D107","999999=+Form54!D108","999999=+Form54!D109",0,"999999=+Form54!D110","999999=+Form54!E105","999999=+Form54!F105","999999=+Form54!E106","999999=+Form54!F106","999999=+Form54!E107","999999=+Form54!F107","999999=+Form54!F108","999999=+Form54!F109",0,"999999=+Form54!F110","999999=+Form54!G105","999999=+Form54!H105","999999=+Form54!G106","999999=+Form54!H106","999999=+Form54!G107","999999=+Form54!H107","999999=+Form54!H108","999999=+Form54!H109",0,"999999=+Form54!H110","999999=+Form54!J105","999999=+Form54!J106","999999=+Form54!C123",null,"999999=+Form54!D123","999999=+Form54!C124","999999=+Form54!C125","999999=+Form54!C126","999999=+Form54!C127","999999=+Form54!C129","Non-Divested"]
[55,"999999=+MID(CELL(\"filename\",A1),FIND(\"[\",CELL(\"filename\",A1))+1,FIND(\"]\", CELL(\"filename\",A1))-FIND(\"[\",CELL(\"filename\",A1))-1)",null,null,"999999=+Form55!E5",55,"999999=+Form55!C7",null,"999999=+Form55!C8","999999=+Form55!C9","999999=+Form55!C10","999999=+Form55!C11","999999=+Form55!E11","999999=+Form55!F11","999999=+Form55!C12","999999=+Form55!C16","999999=+Form55!C17","999999=+Form55!E17","999999=+Form55!F17","999999=+Form55!C18","999999=+Form55!F18","999999=+Form55!C19","999999=+Form55!C20","999999=+Form55!E20","999999=+Form55!C24","999999=+Form55!C25","999999=+Form55!C26","999999=+Form55!F26","999999=+Form55!C27","999999=+Form55!C28","999999=+Form55!E28","999999=+Form55!F28","999999=+Form55!C29","999999=+Form55!C30","999999=+Form55!C31","999999=+Form55!C32","999999=+Form55!C33","999999=+Form55!C37",null,"999999=+Form55!C38",null,"999999=+Form55!C39",null,"999999=+Form55!C40",null,"999999=+Form55!C41","999999=+Form55!C47","999999=+Form55!C48","999999=+Form55!C49","999999=+Form55!C50","999999=+Form55!C51","999999=+Form55!C52","999999=+Form55!C53","999999=+Form55!C54","999999=+Form55!C55","999999=+Form55!C56","999999=+Form55!C57","999999=+Form55!C58","999999=+Form55!D47","999999=+Form55!D48","999999=+Form55!D49","999999=+Form55!D50","999999=+Form55!D51","999999=+Form55!D52","999999=+Form55!D53","999999=+Form55!D54","999999=+Form55!D55","999999=+Form55!D56","999999=+Form55!D57","999999=+Form55!D58","999999=+Form55!E47","999999=+Form55!E48","999999=+Form55!E49","999999=+Form55!E50","999999=+Form55!E51","999999=+Form55!E52","999999=+Form55!E53","999999=+Form55!E54","999999=+Form55!E55","999999=+Form55!E56","999999=+Form55!E57","999999=+Form55!E58","999999=+Form55!$C$60","999999=+Form55!C64","999999=+Form55!C65",null,"999999=+Form55!C66","999999=+Form55!C67","999999=+Form55!$E$67","999999=+Form55!C68","999999=+Form55!C69","999999=+Form55!E69","999999=+Form55!C70","999999=+Form55!C71","999999=+Form55!C72","999999=+Form55!C73","999999=+Form55!E73","999999=+Form55!C78","999999=+Form55!C79","999999=+Form55!C80","999999=+Form55!D78","999999=+Form55!D79","999999=+Form55!D80","999999=+Form55!E78","999999=+Form55!E79","999999=+Form55!E80","999999=+Form55!C82","999999=+Form55!C95","999999=+Form55!D95","999999=+Form55!C96","999999=+Form55!D96","999999=+Form55!C97","999999=+Form55!D97","999999=+Form55!D98","999999=+Form55!D99",0,"999999=+Form55!D100","999999=+Form55!E95","999999=+Form55!F95","999999=+Form55!E96","999999=+Form55!F96","999999=+Form55!E97","999999=+Form55!F97","999999=+Form55!F98","999999=+Form55!F99",0,"999999=+Form55!F100","999999=+Form55!G95","999999=+Form55!H95","999999=+Form55!G96","999999=+Form55!H96","999999=+Form55!G97","999999=+Form55!H97","999999=+Form55!H98","999999=+Form55!H99",0,"999999=+Form55!H100","999999=+Form55!C105","999999=+Form55!D105","999999=+Form55!C106","999999=+Form55!D106","999999=+Form55!C107","999999=+Form55!D107","999999=+Form55!D108","999999=+Form55!D109",0,"999999=+Form55!D110","999999=+Form55!E105","999999=+Form55!F105","999999=+Form55!E106","999999=+Form55!F106","999999=+Form55!E107","999999=+Form55!F107","999999=+Form55!F108","999999=+Form55!F109",0,"999999=+Form55!F110","999999=+Form55!G105","999999=+Form55!H105","999999=+Form55!G106","999999=+Form55!H106","999999=+Form55!G107","999999=+Form55!H107","999999=+Form55!H108","999999=+Form55!H109",0,"999999=+Form55!H110","999999=+Form55!J105","999999=+Form55!J106","999999=+Form55!C123",null,"999999=+Form55!D123","999999=+Form55!C124","999999=+Form55!C125","999999=+Form55!C126","999999=+Form55!C127","999999=+Form55!C129","Non-Divested"]
[56,"999999=+MID(CELL(\"filename\",A1),FIND(\"[\",CELL(\"filename\",A1))+1,FIND(\"]\", CELL(\"filename\",A1))-FIND(\"[\",CELL(\"filename\",A1))-1)",null,null,"999999=+Form56!E5",56,"999999=+Form56!C7",null,"999999=+Form56!C8","999999=+Form56!C9","999999=+Form56!C10","999999=+Form56!C11","999999=+Form56!E11","999999=+Form56!F11","999999=+Form56!C12","999999=+Form56!C16","999999=+Form56!C17","999999=+Form56!E17","999999=+Form56!F17","999999=+Form56!C18","999999=+Form56!F18","999999=+Form56!C19","999999=+Form56!C20","999999=+Form56!E20","999999=+Form56!C24","999999=+Form56!C25","999999=+Form56!C26","999999=+Form56!F26","999999=+Form56!C27","999999=+Form56!C28","999999=+Form56!E28","999999=+Form56!F28","999999=+Form56!C29","999999=+Form56!C30","999999=+Form56!C31","999999=+Form56!C32","999999=+Form56!C33","999999=+Form56!C37",null,"999999=+Form56!C38",null,"999999=+Form56!C39",null,"999999=+Form56!C40",null,"999999=+Form56!C41","999999=+Form56!C47","999999=+Form56!C48","999999=+Form56!C49","999999=+Form56!C50","999999=+Form56!C51","999999=+Form56!C52","999999=+Form56!C53","999999=+Form56!C54","999999=+Form56!C55","999999=+Form56!C56","999999=+Form56!C57","999999=+Form56!C58","999999=+Form56!D47","999999=+Form56!D48","999999=+Form56!D49","999999=+Form56!D50","999999=+Form56!D51","999999=+Form56!D52","999999=+Form56!D53","999999=+Form56!D54","999999=+Form56!D55","999999=+Form56!D56","999999=+Form56!D57","999999=+Form56!D58","999999=+Form56!E47","999999=+Form56!E48","999999=+Form56!E49","999999=+Form56!E50","999999=+Form56!E51","999999=+Form56!E52","999999=+Form56!E53","999999=+Form56!E54","999999=+Form56!E55","999999=+Form56!E56","999999=+Form56!E57","999999=+Form56!E58","999999=+Form56!$C$60","999999=+Form56!C64","999999=+Form56!C65",null,"999999=+Form56!C66","999999=+Form56!C67","999999=+Form56!$E$67","999999=+Form56!C68","999999=+Form56!C69","999999=+Form56!E69","999999=+Form56!C70","999999=+Form56!C71","999999=+Form56!C72","999999=+Form56!C73","999999=+Form56!E73","999999=+Form56!C78","999999=+Form56!C79","999999=+Form56!C80","999999=+Form56!D78","999999=+Form56!D79","999999=+Form56!D80","999999=+Form56!E78","999999=+Form56!E79","999999=+Form56!E80","999999=+Form56!C82","999999=+Form56!C95","999999=+Form56!D95","999999=+Form56!C96","999999=+Form56!D96","999999=+Form56!C97","999999=+Form56!D97","999999=+Form56!D98","999999=+Form56!D99",0,"999999=+Form56!D100","999999=+Form56!E95","999999=+Form56!F95","999999=+Form56!E96","999999=+Form56!F96","999999=+Form56!E97","999999=+Form56!F97","999999=+Form56!F98","999999=+Form56!F99",0,"999999=+Form56!F100","999999=+Form56!G95","999999=+Form56!H95","999999=+Form56!G96","999999=+Form56!H96","999999=+Form56!G97","999999=+Form56!H97","999999=+Form56!H98","999999=+Form56!H99",0,"999999=+Form56!H100","999999=+Form56!C105","999999=+Form56!D105","999999=+Form56!C106","999999=+Form56!D106","999999=+Form56!C107","999999=+Form56!D107","999999=+Form56!D108","999999=+Form56!D109",0,"999999=+Form56!D110","999999=+Form56!E105","999999=+Form56!F105","999999=+Form56!E106","999999=+Form56!F106","999999=+Form56!E107","999999=+Form56!F107","999999=+Form56!F108","999999=+Form56!F109",0,"999999=+Form56!F110","999999=+Form56!G105","999999=+Form56!H105","999999=+Form56!G106","999999=+Form56!H106","999999=+Form56!G107","999999=+Form56!H107","999999=+Form56!H108","999999=+Form56!H109",0,"999999=+Form56!H110","999999=+Form56!J105","999999=+Form56!J106","999999=+Form56!C123",null,"999999=+Form56!D123","999999=+Form56!C124","999999=+Form56!C125","999999=+Form56!C126","999999=+Form56!C127","999999=+Form56!C129","Non-Divested"]
[57,"999999=+MID(CELL(\"filename\",A1),FIND(\"[\",CELL(\"filename\",A1))+1,FIND(\"]\", CELL(\"filename\",A1))-FIND(\"[\",CELL(\"filename\",A1))-1)",null,null,"999999=+Form57!E5",57,"999999=+Form57!C7",null,"999999=+Form57!C8","999999=+Form57!C9","999999=+Form57!C10","999999=+Form57!C11","999999=+Form57!E11","999999=+Form57!F11","999999=+Form57!C12","999999=+Form57!C16","999999=+Form57!C17","999999=+Form57!E17","999999=+Form57!F17","999999=+Form57!C18","999999=+Form57!F18","999999=+Form57!C19","999999=+Form57!C20","999999=+Form57!E20","999999=+Form57!C24","999999=+Form57!C25","999999=+Form57!C26","999999=+Form57!F26","999999=+Form57!C27","999999=+Form57!C28","999999=+Form57!E28","999999=+Form57!F28","999999=+Form57!C29","999999=+Form57!C30","999999=+Form57!C31","999999=+Form57!C32","999999=+Form57!C33","999999=+Form57!C37",null,"999999=+Form57!C38",null,"999999=+Form57!C39",null,"999999=+Form57!C40",null,"999999=+Form57!C41","999999=+Form57!C47","999999=+Form57!C48","999999=+Form57!C49","999999=+Form57!C50","999999=+Form57!C51","999999=+Form57!C52","999999=+Form57!C53","999999=+Form57!C54","999999=+Form57!C55","999999=+Form57!C56","999999=+Form57!C57","999999=+Form57!C58","999999=+Form57!D47","999999=+Form57!D48","999999=+Form57!D49","999999=+Form57!D50","999999=+Form57!D51","999999=+Form57!D52","999999=+Form57!D53","999999=+Form57!D54","999999=+Form57!D55","999999=+Form57!D56","999999=+Form57!D57","999999=+Form57!D58","999999=+Form57!E47","999999=+Form57!E48","999999=+Form57!E49","999999=+Form57!E50","999999=+Form57!E51","999999=+Form57!E52","999999=+Form57!E53","999999=+Form57!E54","999999=+Form57!E55","999999=+Form57!E56","999999=+Form57!E57","999999=+Form57!E58","999999=+Form57!$C$60","999999=+Form57!C64","999999=+Form57!C65",null,"999999=+Form57!C66","999999=+Form57!C67","999999=+Form57!$E$67","999999=+Form57!C68","999999=+Form57!C69","999999=+Form57!E69","999999=+Form57!C70","999999=+Form57!C71","999999=+Form57!C72","999999=+Form57!C73","999999=+Form57!E73","999999=+Form57!C78","999999=+Form57!C79","999999=+Form57!C80","999999=+Form57!D78","999999=+Form57!D79","999999=+Form57!D80","999999=+Form57!E78","999999=+Form57!E79","999999=+Form57!E80","999999=+Form57!C82","999999=+Form57!C95","999999=+Form57!D95","999999=+Form57!C96","999999=+Form57!D96","999999=+Form57!C97","999999=+Form57!D97","999999=+Form57!D98","999999=+Form57!D99",0,"999999=+Form57!D100","999999=+Form57!E95","999999=+Form57!F95","999999=+Form57!E96","999999=+Form57!F96","999999=+Form57!E97","999999=+Form57!F97","999999=+Form57!F98","999999=+Form57!F99",0,"999999=+Form57!F100","999999=+Form57!G95","999999=+Form57!H95","999999=+Form57!G96","999999=+Form57!H96","999999=+Form57!G97","999999=+Form57!H97","999999=+Form57!H98","999999=+Form57!H99",0,"999999=+Form57!H100","999999=+Form57!C105","999999=+Form57!D105","999999=+Form57!C106","999999=+Form57!D106","999999=+Form57!C107","999999=+Form57!D107","999999=+Form57!D108","999999=+Form57!D109",0,"999999=+Form57!D110","999999=+Form57!E105","999999=+Form57!F105","999999=+Form57!E106","999999=+Form57!F106","999999=+Form57!E107","999999=+Form57!F107","999999=+Form57!F108","999999=+Form57!F109",0,"999999=+Form57!F110","999999=+Form57!G105","999999=+Form57!H105","999999=+Form57!G106","999999=+Form57!H106","999999=+Form57!G107","999999=+Form57!H107","999999=+Form57!H108","999999=+Form57!H109",0,"999999=+Form57!H110","999999=+Form57!J105","999999=+Form57!J106","999999=+Form57!C123",null,"999999=+Form57!D123","999999=+Form57!C124","999999=+Form57!C125","999999=+Form57!C126","999999=+Form57!C127","999999=+Form57!C129","Non-Divested"]
[58,"999999=+MID(CELL(\"filename\",A1),FIND(\"[\",CELL(\"filename\",A1))+1,FIND(\"]\", CELL(\"filename\",A1))-FIND(\"[\",CELL(\"filename\",A1))-1)",null,null,"999999=+Form58!E5",58,"999999=+Form58!C7",null,"999999=+Form58!C8","999999=+Form58!C9","999999=+Form58!C10","999999=+Form58!C11","999999=+Form58!E11","999999=+Form58!F11","999999=+Form58!C12","999999=+Form58!C16","999999=+Form58!C17","999999=+Form58!E17","999999=+Form58!F17","999999=+Form58!C18","999999=+Form58!F18","999999=+Form58!C19","999999=+Form58!C20","999999=+Form58!E20","999999=+Form58!C24","999999=+Form58!C25","999999=+Form58!C26","999999=+Form58!F26","999999=+Form58!C27","999999=+Form58!C28","999999=+Form58!E28","999999=+Form58!F28","999999=+Form58!C29","999999=+Form58!C30","999999=+Form58!C31","999999=+Form58!C32","999999=+Form58!C33","999999=+Form58!C37",null,"999999=+Form58!C38",null,"999999=+Form58!C39",null,"999999=+Form58!C40",null,"999999=+Form58!C41","999999=+Form58!C47","999999=+Form58!C48","999999=+Form58!C49","999999=+Form58!C50","999999=+Form58!C51","999999=+Form58!C52","999999=+Form58!C53","999999=+Form58!C54","999999=+Form58!C55","999999=+Form58!C56","999999=+Form58!C57","999999=+Form58!C58","999999=+Form58!D47","999999=+Form58!D48","999999=+Form58!D49","999999=+Form58!D50","999999=+Form58!D51","999999=+Form58!D52","999999=+Form58!D53","999999=+Form58!D54","999999=+Form58!D55","999999=+Form58!D56","999999=+Form58!D57","999999=+Form58!D58","999999=+Form58!E47","999999=+Form58!E48","999999=+Form58!E49","999999=+Form58!E50","999999=+Form58!E51","999999=+Form58!E52","999999=+Form58!E53","999999=+Form58!E54","999999=+Form58!E55","999999=+Form58!E56","999999=+Form58!E57","999999=+Form58!E58","999999=+Form58!$C$60","999999=+Form58!C64","999999=+Form58!C65",null,"999999=+Form58!C66","999999=+Form58!C67","999999=+Form58!$E$67","999999=+Form58!C68","999999=+Form58!C69","999999=+Form58!E69","999999=+Form58!C70","999999=+Form58!C71","999999=+Form58!C72","999999=+Form58!C73","999999=+Form58!E73","999999=+Form58!C78","999999=+Form58!C79","999999=+Form58!C80","999999=+Form58!D78","999999=+Form58!D79","999999=+Form58!D80","999999=+Form58!E78","999999=+Form58!E79","999999=+Form58!E80","999999=+Form58!C82","999999=+Form58!C95","999999=+Form58!D95","999999=+Form58!C96","999999=+Form58!D96","999999=+Form58!C97","999999=+Form58!D97","999999=+Form58!D98","999999=+Form58!D99",0,"999999=+Form58!D100","999999=+Form58!E95","999999=+Form58!F95","999999=+Form58!E96","999999=+Form58!F96","999999=+Form58!E97","999999=+Form58!F97","999999=+Form58!F98","999999=+Form58!F99",0,"999999=+Form58!F100","999999=+Form58!G95","999999=+Form58!H95","999999=+Form58!G96","999999=+Form58!H96","999999=+Form58!G97","999999=+Form58!H97","999999=+Form58!H98","999999=+Form58!H99",0,"999999=+Form58!H100","999999=+Form58!C105","999999=+Form58!D105","999999=+Form58!C106","999999=+Form58!D106","999999=+Form58!C107","999999=+Form58!D107","999999=+Form58!D108","999999=+Form58!D109",0,"999999=+Form58!D110","999999=+Form58!E105","999999=+Form58!F105","999999=+Form58!E106","999999=+Form58!F106","999999=+Form58!E107","999999=+Form58!F107","999999=+Form58!F108","999999=+Form58!F109",0,"999999=+Form58!F110","999999=+Form58!G105","999999=+Form58!H105","999999=+Form58!G106","999999=+Form58!H106","999999=+Form58!G107","999999=+Form58!H107","999999=+Form58!H108","999999=+Form58!H109",0,"999999=+Form58!H110","999999=+Form58!J105","999999=+Form58!J106","999999=+Form58!C123",null,"999999=+Form58!D123","999999=+Form58!C124","999999=+Form58!C125","999999=+Form58!C126","999999=+Form58!C127","999999=+Form58!C129","Non-Divested"]
[59,"999999=+MID(CELL(\"filename\",A1),FIND(\"[\",CELL(\"filename\",A1))+1,FIND(\"]\", CELL(\"filename\",A1))-FIND(\"[\",CELL(\"filename\",A1))-1)",null,null,"999999=+Form59!E5",59,"999999=+Form59!C7",null,"999999=+Form59!C8","999999=+Form59!C9","999999=+Form59!C10","999999=+Form59!C11","999999=+Form59!E11","999999=+Form59!F11","999999=+Form59!C12","999999=+Form59!C16","999999=+Form59!C17","999999=+Form59!E17","999999=+Form59!F17","999999=+Form59!C18","999999=+Form59!F18","999999=+Form59!C19","999999=+Form59!C20","999999=+Form59!E20","999999=+Form59!C24","999999=+Form59!C25","999999=+Form59!C26","999999=+Form59!F26","999999=+Form59!C27","999999=+Form59!C28","999999=+Form59!E28","999999=+Form59!F28","999999=+Form59!C29","999999=+Form59!C30","999999=+Form59!C31","999999=+Form59!C32","999999=+Form59!C33","999999=+Form59!C37",null,"999999=+Form59!C38",null,"999999=+Form59!C39",null,"999999=+Form59!C40",null,"999999=+Form59!C41","999999=+Form59!C47","999999=+Form59!C48","999999=+Form59!C49","999999=+Form59!C50","999999=+Form59!C51","999999=+Form59!C52","999999=+Form59!C53","999999=+Form59!C54","999999=+Form59!C55","999999=+Form59!C56","999999=+Form59!C57","999999=+Form59!C58","999999=+Form59!D47","999999=+Form59!D48","999999=+Form59!D49","999999=+Form59!D50","999999=+Form59!D51","999999=+Form59!D52","999999=+Form59!D53","999999=+Form59!D54","999999=+Form59!D55","999999=+Form59!D56","999999=+Form59!D57","999999=+Form59!D58","999999=+Form59!E47","999999=+Form59!E48","999999=+Form59!E49","999999=+Form59!E50","999999=+Form59!E51","999999=+Form59!E52","999999=+Form59!E53","999999=+Form59!E54","999999=+Form59!E55","999999=+Form59!E56","999999=+Form59!E57","999999=+Form59!E58","999999=+Form59!$C$60","999999=+Form59!C64","999999=+Form59!C65",null,"999999=+Form59!C66","999999=+Form59!C67","999999=+Form59!$E$67","999999=+Form59!C68","999999=+Form59!C69","999999=+Form59!E69","999999=+Form59!C70","999999=+Form59!C71","999999=+Form59!C72","999999=+Form59!C73","999999=+Form59!E73","999999=+Form59!C78","999999=+Form59!C79","999999=+Form59!C80","999999=+Form59!D78","999999=+Form59!D79","999999=+Form59!D80","999999=+Form59!E78","999999=+Form59!E79","999999=+Form59!E80","999999=+Form59!C82","999999=+Form59!C95","999999=+Form59!D95","999999=+Form59!C96","999999=+Form59!D96","999999=+Form59!C97","999999=+Form59!D97","999999=+Form59!D98","999999=+Form59!D99",0,"999999=+Form59!D100","999999=+Form59!E95","999999=+Form59!F95","999999=+Form59!E96","999999=+Form59!F96","999999=+Form59!E97","999999=+Form59!F97","999999=+Form59!F98","999999=+Form59!F99",0,"999999=+Form59!F100","999999=+Form59!G95","999999=+Form59!H95","999999=+Form59!G96","999999=+Form59!H96","999999=+Form59!G97","999999=+Form59!H97","999999=+Form59!H98","999999=+Form59!H99",0,"999999=+Form59!H100","999999=+Form59!C105","999999=+Form59!D105","999999=+Form59!C106","999999=+Form59!D106","999999=+Form59!C107","999999=+Form59!D107","999999=+Form59!D108","999999=+Form59!D109",0,"999999=+Form59!D110","999999=+Form59!E105","999999=+Form59!F105","999999=+Form59!E106","999999=+Form59!F106","999999=+Form59!E107","999999=+Form59!F107","999999=+Form59!F108","999999=+Form59!F109",0,"999999=+Form59!F110","999999=+Form59!G105","999999=+Form59!H105","999999=+Form59!G106","999999=+Form59!H106","999999=+Form59!G107","999999=+Form59!H107","999999=+Form59!H108","999999=+Form59!H109",0,"999999=+Form59!H110","999999=+Form59!J105","999999=+Form59!J106","999999=+Form59!C123",null,"999999=+Form59!D123","999999=+Form59!C124","999999=+Form59!C125","999999=+Form59!C126","999999=+Form59!C127","999999=+Form59!C129","Non-Divested"]
[60,"999999=+MID(CELL(\"filename\",A1),FIND(\"[\",CELL(\"filename\",A1))+1,FIND(\"]\", CELL(\"filename\",A1))-FIND(\"[\",CELL(\"filename\",A1))-1)",null,null,"999999=+Form60!E5",60,"999999=+Form60!C7",null,"999999=+Form60!C8","999999=+Form60!C9","999999=+Form60!C10","999999=+Form60!C11","999999=+Form60!E11","999999=+Form60!F11","999999=+Form60!C12","999999=+Form60!C16","999999=+Form60!C17","999999=+Form60!E17","999999=+Form60!F17","999999=+Form60!C18","999999=+Form60!F18","999999=+Form60!C19","999999=+Form60!C20","999999=+Form60!E20","999999=+Form60!C24","999999=+Form60!C25","999999=+Form60!C26","999999=+Form60!F26","999999=+Form60!C27","999999=+Form60!C28","999999=+Form60!E28","999999=+Form60!F28","999999=+Form60!C29","999999=+Form60!C30","999999=+Form60!C31","999999=+Form60!C32","999999=+Form60!C33","999999=+Form60!C37",null,"999999=+Form60!C38",null,"999999=+Form60!C39",null,"999999=+Form60!C40",null,"999999=+Form60!C41","999999=+Form60!C47","999999=+Form60!C48","999999=+Form60!C49","999999=+Form60!C50","999999=+Form60!C51","999999=+Form60!C52","999999=+Form60!C53","999999=+Form60!C54","999999=+Form60!C55","999999=+Form60!C56","999999=+Form60!C57","999999=+Form60!C58","999999=+Form60!D47","999999=+Form60!D48","999999=+Form60!D49","999999=+Form60!D50","999999=+Form60!D51","999999=+Form60!D52","999999=+Form60!D53","999999=+Form60!D54","999999=+Form60!D55","999999=+Form60!D56","999999=+Form60!D57","999999=+Form60!D58","999999=+Form60!E47","999999=+Form60!E48","999999=+Form60!E49","999999=+Form60!E50","999999=+Form60!E51","999999=+Form60!E52","999999=+Form60!E53","999999=+Form60!E54","999999=+Form60!E55","999999=+Form60!E56","999999=+Form60!E57","999999=+Form60!E58","999999=+Form60!$C$60","999999=+Form60!C64","999999=+Form60!C65",null,"999999=+Form60!C66","999999=+Form60!C67","999999=+Form60!$E$67","999999=+Form60!C68","999999=+Form60!C69","999999=+Form60!E69","999999=+Form60!C70","999999=+Form60!C71","999999=+Form60!C72","999999=+Form60!C73","999999=+Form60!E73","999999=+Form60!C78","999999=+Form60!C79","999999=+Form60!C80","999999=+Form60!D78","999999=+Form60!D79","999999=+Form60!D80","999999=+Form60!E78","999999=+Form60!E79","999999=+Form60!E80","999999=+Form60!C82","999999=+Form60!C95","999999=+Form60!D95","999999=+Form60!C96","999999=+Form60!D96","999999=+Form60!C97","999999=+Form60!D97","999999=+Form60!D98","999999=+Form60!D99",0,"999999=+Form60!D100","999999=+Form60!E95","999999=+Form60!F95","999999=+Form60!E96","999999=+Form60!F96","999999=+Form60!E97","999999=+Form60!F97","999999=+Form60!F98","999999=+Form60!F99",0,"999999=+Form60!F100","999999=+Form60!G95","999999=+Form60!H95","999999=+Form60!G96","999999=+Form60!H96","999999=+Form60!G97","999999=+Form60!H97","999999=+Form60!H98","999999=+Form60!H99",0,"999999=+Form60!H100","999999=+Form60!C105","999999=+Form60!D105","999999=+Form60!C106","999999=+Form60!D106","999999=+Form60!C107","999999=+Form60!D107","999999=+Form60!D108","999999=+Form60!D109",0,"999999=+Form60!D110","999999=+Form60!E105","999999=+Form60!F105","999999=+Form60!E106","999999=+Form60!F106","999999=+Form60!E107","999999=+Form60!F107","999999=+Form60!F108","999999=+Form60!F109",0,"999999=+Form60!F110","999999=+Form60!G105","999999=+Form60!H105","999999=+Form60!G106","999999=+Form60!H106","999999=+Form60!G107","999999=+Form60!H107","999999=+Form60!H108","999999=+Form60!H109",0,"999999=+Form60!H110","999999=+Form60!J105","999999=+Form60!J106","999999=+Form60!C123",null,"999999=+Form60!D123","999999=+Form60!C124","999999=+Form60!C125","999999=+Form60!C126","999999=+Form60!C127","999999=+Form60!C129","Non-Divested"]
[61,"999999=+MID(CELL(\"filename\",A1),FIND(\"[\",CELL(\"filename\",A1))+1,FIND(\"]\", CELL(\"filename\",A1))-FIND(\"[\",CELL(\"filename\",A1))-1)",null,null,"999999=+Form61!E5",61,"999999=+Form61!C7",null,"999999=+Form61!C8","999999=+Form61!C9","999999=+Form61!C10","999999=+Form61!C11","999999=+Form61!E11","999999=+Form61!F11","999999=+Form61!C12","999999=+Form61!C16","999999=+Form61!C17","999999=+Form61!E17","999999=+Form61!F17","999999=+Form61!C18","999999=+Form61!F18","999999=+Form61!C19","999999=+Form61!C20","999999=+Form61!E20","999999=+Form61!C24","999999=+Form61!C25","999999=+Form61!C26","999999=+Form61!F26","999999=+Form61!C27","999999=+Form61!C28","999999=+Form61!E28","999999=+Form61!F28","999999=+Form61!C29","999999=+Form61!C30","999999=+Form61!C31","999999=+Form61!C32","999999=+Form61!C33","999999=+Form61!C37",null,"999999=+Form61!C38",null,"999999=+Form61!C39",null,"999999=+Form61!C40",null,"999999=+Form61!C41","999999=+Form61!C47","999999=+Form61!C48","999999=+Form61!C49","999999=+Form61!C50","999999=+Form61!C51","999999=+Form61!C52","999999=+Form61!C53","999999=+Form61!C54","999999=+Form61!C55","999999=+Form61!C56","999999=+Form61!C57","999999=+Form61!C58","999999=+Form61!D47","999999=+Form61!D48","999999=+Form61!D49","999999=+Form61!D50","999999=+Form61!D51","999999=+Form61!D52","999999=+Form61!D53","999999=+Form61!D54","999999=+Form61!D55","999999=+Form61!D56","999999=+Form61!D57","999999=+Form61!D58","999999=+Form61!E47","999999=+Form61!E48","999999=+Form61!E49","999999=+Form61!E50","999999=+Form61!E51","999999=+Form61!E52","999999=+Form61!E53","999999=+Form61!E54","999999=+Form61!E55","999999=+Form61!E56","999999=+Form61!E57","999999=+Form61!E58","999999=+Form61!$C$60","999999=+Form61!C64","999999=+Form61!C65",null,"999999=+Form61!C66","999999=+Form61!C67","999999=+Form61!$E$67","999999=+Form61!C68","999999=+Form61!C69","999999=+Form61!E69","999999=+Form61!C70","999999=+Form61!C71","999999=+Form61!C72","999999=+Form61!C73","999999=+Form61!E73","999999=+Form61!C78","999999=+Form61!C79","999999=+Form61!C80","999999=+Form61!D78","999999=+Form61!D79","999999=+Form61!D80","999999=+Form61!E78","999999=+Form61!E79","999999=+Form61!E80","999999=+Form61!C82","999999=+Form61!C95","999999=+Form61!D95","999999=+Form61!C96","999999=+Form61!D96","999999=+Form61!C97","999999=+Form61!D97","999999=+Form61!D98","999999=+Form61!D99",0,"999999=+Form61!D100","999999=+Form61!E95","999999=+Form61!F95","999999=+Form61!E96","999999=+Form61!F96","999999=+Form61!E97","999999=+Form61!F97","999999=+Form61!F98","999999=+Form61!F99",0,"999999=+Form61!F100","999999=+Form61!G95","999999=+Form61!H95","999999=+Form61!G96","999999=+Form61!H96","999999=+Form61!G97","999999=+Form61!H97","999999=+Form61!H98","999999=+Form61!H99",0,"999999=+Form61!H100","999999=+Form61!C105","999999=+Form61!D105","999999=+Form61!C106","999999=+Form61!D106","999999=+Form61!C107","999999=+Form61!D107","999999=+Form61!D108","999999=+Form61!D109",0,"999999=+Form61!D110","999999=+Form61!E105","999999=+Form61!F105","999999=+Form61!E106","999999=+Form61!F106","999999=+Form61!E107","999999=+Form61!F107","999999=+Form61!F108","999999=+Form61!F109",0,"999999=+Form61!F110","999999=+Form61!G105","999999=+Form61!H105","999999=+Form61!G106","999999=+Form61!H106","999999=+Form61!G107","999999=+Form61!H107","999999=+Form61!H108","999999=+Form61!H109",0,"999999=+Form61!H110","999999=+Form61!J105","999999=+Form61!J106","999999=+Form61!C123",null,"999999=+Form61!D123","999999=+Form61!C124","999999=+Form61!C125","999999=+Form61!C126","999999=+Form61!C127","999999=+Form61!C129","Non-Divested"]
[62,"999999=+MID(CELL(\"filename\",A1),FIND(\"[\",CELL(\"filename\",A1))+1,FIND(\"]\", CELL(\"filename\",A1))-FIND(\"[\",CELL(\"filename\",A1))-1)",null,null,"999999=+Form62!E5",62,"999999=+Form62!C7",null,"999999=+Form62!C8","999999=+Form62!C9","999999=+Form62!C10","999999=+Form62!C11","999999=+Form62!E11","999999=+Form62!F11","999999=+Form62!C12","999999=+Form62!C16","999999=+Form62!C17","999999=+Form62!E17","999999=+Form62!F17","999999=+Form62!C18","999999=+Form62!F18","999999=+Form62!C19","999999=+Form62!C20","999999=+Form62!E20","999999=+Form62!C24","999999=+Form62!C25","999999=+Form62!C26","999999=+Form62!F26","999999=+Form62!C27","999999=+Form62!C28","999999=+Form62!E28","999999=+Form62!F28","999999=+Form62!C29","999999=+Form62!C30","999999=+Form62!C31","999999=+Form62!C32","999999=+Form62!C33","999999=+Form62!C37",null,"999999=+Form62!C38",null,"999999=+Form62!C39",null,"999999=+Form62!C40",null,"999999=+Form62!C41","999999=+Form62!C47","999999=+Form62!C48","999999=+Form62!C49","999999=+Form62!C50","999999=+Form62!C51","999999=+Form62!C52","999999=+Form62!C53","999999=+Form62!C54","999999=+Form62!C55","999999=+Form62!C56","999999=+Form62!C57","999999=+Form62!C58","999999=+Form62!D47","999999=+Form62!D48","999999=+Form62!D49","999999=+Form62!D50","999999=+Form62!D51","999999=+Form62!D52","999999=+Form62!D53","999999=+Form62!D54","999999=+Form62!D55","999999=+Form62!D56","999999=+Form62!D57","999999=+Form62!D58","999999=+Form62!E47","999999=+Form62!E48","999999=+Form62!E49","999999=+Form62!E50","999999=+Form62!E51","999999=+Form62!E52","999999=+Form62!E53","999999=+Form62!E54","999999=+Form62!E55","999999=+Form62!E56","999999=+Form62!E57","999999=+Form62!E58","999999=+Form62!$C$60","999999=+Form62!C64","999999=+Form62!C65",null,"999999=+Form62!C66","999999=+Form62!C67","999999=+Form62!$E$67","999999=+Form62!C68","999999=+Form62!C69","999999=+Form62!E69","999999=+Form62!C70","999999=+Form62!C71","999999=+Form62!C72","999999=+Form62!C73","999999=+Form62!E73","999999=+Form62!C78","999999=+Form62!C79","999999=+Form62!C80","999999=+Form62!D78","999999=+Form62!D79","999999=+Form62!D80","999999=+Form62!E78","999999=+Form62!E79","999999=+Form62!E80","999999=+Form62!C82","999999=+Form62!C95","999999=+Form62!D95","999999=+Form62!C96","999999=+Form62!D96","999999=+Form62!C97","999999=+Form62!D97","999999=+Form62!D98","999999=+Form62!D99",0,"999999=+Form62!D100","999999=+Form62!E95","999999=+Form62!F95","999999=+Form62!E96","999999=+Form62!F96","999999=+Form62!E97","999999=+Form62!F97","999999=+Form62!F98","999999=+Form62!F99",0,"999999=+Form62!F100","999999=+Form62!G95","999999=+Form62!H95","999999=+Form62!G96","999999=+Form62!H96","999999=+Form62!G97","999999=+Form62!H97","999999=+Form62!H98","999999=+Form62!H99",0,"999999=+Form62!H100","999999=+Form62!C105","999999=+Form62!D105","999999=+Form62!C106","999999=+Form62!D106","999999=+Form62!C107","999999=+Form62!D107","999999=+Form62!D108","999999=+Form62!D109",0,"999999=+Form62!D110","999999=+Form62!E105","999999=+Form62!F105","999999=+Form62!E106","999999=+Form62!F106","999999=+Form62!E107","999999=+Form62!F107","999999=+Form62!F108","999999=+Form62!F109",0,"999999=+Form62!F110","999999=+Form62!G105","999999=+Form62!H105","999999=+Form62!G106","999999=+Form62!H106","999999=+Form62!G107","999999=+Form62!H107","999999=+Form62!H108","999999=+Form62!H109",0,"999999=+Form62!H110","999999=+Form62!J105","999999=+Form62!J106","999999=+Form62!C123",null,"999999=+Form62!D123","999999=+Form62!C124","999999=+Form62!C125","999999=+Form62!C126","999999=+Form62!C127","999999=+Form62!C129","Non-Divested"]

{"sheet":"Summary","index":5,"n_rows":86,"n_cols":96,"rows_kept":86,"cut":false,"hidden":false,"merged":[[9,41,9,49],[9,59,9,67],[9,68,9,76],[9,78,9,86],[9,87,9,95],[9,50,9,58],[0,10,0,19],[1,10,1,19],[2,10,2,19],[5,11,6,14],[5,18,6,19]]}
["Summary of Education and Community Partnership Program Claims - 2021-22:"]
["Sommaire des demandes pour programme de partenariats pour l'éducation avec les établissements communautaires  - 2021-22",null,null,null,null,null,null,null,null,null,"Attestation"]
[null,null,null,null,null,null,null,null,null,null,"I certify that the information on this report is a true representation of the Board's actual expenditures on Education and Community Partnership Programs facilities in 2020-21 and the best estimation of projected expenditures on Education and Community Partnership Programs facilities in 2021-22 / J'atteste que les renseignements soumis dans ce rapport reflètent les coûts réels encourus par le conseil pour les programmes de partenariats pour l'éducation avec les établissements communautaires  en 2020-21 ainsi que la prévision juste des coûts pour les programmes de partenariats pour l'éducation avec les établissements communautaires en 2021-22"]
[null,null,null,null,null,null,null,null,null,null,"Superintendent / Surintendant(e):",null,null,"999999=+Form1!$C$9"]
[]
[]
[null,null,null,null,null,null,null,null,null,null,"Signature:",null,null,null,null,null,"Date: "]
[]
[null,null,null,null,null,null,null,null,null,null,null,null,null,null,null,null,null,null,null,null,null,null,null,null,null,null,null,null,null,null,null,null,null,null,null,null,null,null,null,null,"SUBTOTALS",{"$f":"SUBTOTAL(9,AP12:AP86)","v":0},{"$f":"SUBTOTAL(9,AQ12:AQ86)","v":0},0,0,0,0,0,0,0,0,0,0,0,0,0,0,0,0,0,0,0,0,0,0,0,0,0,0,0,0,0,0,0,0,0,0,null,0,0,0,0,0,0,0,0,0,0,0,0,0,0,0,0,0,0]
[null,null,null,null,null,null,null,null,null,null,null,null,null,null,null,null,null,null,null,null,null,null,null,null,null,null,null,null,null,null,null,null,null,null,null,null,null,null,null,null,null,"October Forecast 2020-21/Prévisions d'octobre 2020-21",null,null,null,null,null,null,null,null,"Actuals 2020-21/Réel  2020-21",null,null,null,null,null,null,null,null,"Spring Forecast 2021-22/Prévision du printemps 2021-22",null,null,null,null,null,null,null,null,"Spring Approved 2021-22/Approbation du printemps 2021-22",null,null,null,null,null,null,null,null,null," October Forecast 2021-22/Prévisions d'octobre  2021-22",null,null,null,null,null,null,null,null,"October Approved 2021-2022/ Approbation d'October 2021-2022"]
["District School Board Name/ Nom duConseil Scolaire","Board Number/No du conseil","DSB/CDS","Form #/ No de formulaire","Application Type/Type de demande","Facility Name/Nom de\nl'établissement","Facility Address 1/ Adresse de l'établissement 1","Facility Address 2 / Adresse de l'établissement 1","Facility Postal code/Code postal de l'établissement ","Facility Type/Type\nd'établissement","Facility Focus/Point de mire de l’établissement ","Facility Setting/Milieu de l’établissement ","Agency Name/Nom de l'organisme","Agency Address1/Addresse de l'organisme 1","Agency Address2/ Addresse de l'organisme 2","Agency Postal Code/Code postal de l'organisme","Funding Ministry/ Ministère qui subventionne","Funding Ministry 2/ Ministère qui subventionne 2","Panel Division Type/               Cycle du palier","Language of Instruction/ Langue d'enseignement  ","Duration/Durée ","Number of Classrooms in DSB Schools/ Nbre de classes dans les écoles du CSD","Number of Classrooms Not in DSB Schools/Nbre de classes qui ne sont pas dans les écoles du CSD","Total Number of Students Served in 2020-21/ Nbre total d’élèves uniques servis en 2020-21","Location/ Emplacement","From Grade/ De l'année d'études","To Grade/ à l'année d'études","Program Type/ Type de programme ","Program Sub-Type/ Sous-type de programme","Primary Need/Cluster/ Besoin primaire/groupement","Referral Source1/ Sources de références 1","Referral Source 2/ Sources de références 2","Wait List/ Liste d’attente","Number of Children or Youth on Wait List/ Nbre d’enfants/jeunes sur la liste d’attente","Total FTE for Last Year/ ETP  pour l'année dernière","Average Monthly FTE Actual for Last Year/ ETP moyen mensuel pour l'année dernière","PTR According to Agreement/REE (selon l'entente)","Regional Office/ Bureau régional","Educational Officer/ L'Agent/L'Agente d'éducation","Monitoring Year/Année de monitorage","Status/Niveau d'approbation"," Teachers #/Enseignants(es) #"," Teachers $/ Enseignants(es)$"," Educational Assistants #/ Aides-enseignants(es) #"," Educational Assistants $/Aides-enseignants(es) $","Other Salaries #/Autres salaires #"," Other Salaries $/Autres salaires $","Program Amount $/Somme pour dispenser le programme $","Furniture and Equipment $/Mobilier et équipement $","  Total $"," Teachers #/Enseignants(es) #"," Teachers $/ Enseignants(es)$"," Educational Assistants #/ Aides-enseignants(es) #"," Educational Assistants $/Aides-enseignants(es) $","Other Salaries #/Autres salaires #"," Other Salaries $/Autres salaires $"," Program Amount $/Somme pour dispenser le programme $","Furniture and Equipment $/Mobilier et équipement $","  Total $"," Teachers #/Enseignants(es) #"," Teachers $/ Enseignants(es)$"," Educational Assistants #/ Aides-enseignants(es) #"," Educational Assistants $/Aides-enseignants(es) $","Other Salaries #/Autres salaires #"," Other Salaries $/Autres salaires $","  Program Amount $/Somme pour dispenser le programme $","Furniture and Equipment $/Mobilier et équipement $","  Total $"," Teachers #/Enseignants (es) #"," Teachers $/ Enseignants(es)$"," Educational Assistants #/ Aides-enseignants(es) #"," Educational Assistants $/Aides-enseignants(es) $","Other Salaries #/Autres salaires #"," Other Salaries $/Autres salaires $"," Program Amount $/Somme pour dispenser le programme $","Furniture and Equipment $/Mobilier et équipement $","  Total $","COMMENTS/COMMENTAIRES","Teachers # / Enseignants(es) #"," Teachers $ / Enseignants(es) $"," Educational Assistants # / Aides-enseignants(es) #"," Educational Assistants $ /Aides-enseignants(es) $","Other Salaries # / Autres salaires #"," Other Salaries $ / Autres salaires $"," Program Amount $ /Somme dispenser le programme $"," Furniture and Equipment $ /Mobilier et l'équipement $","Total $"," Teachers #/Enseignants(es) #"," Teachers $/ Enseignants(es)$"," Educational Assistants #/ Aides-enseignants(es) #"," Educational Assistants $/Aides-enseignants(es) $","Other Salaries #/Autres salaires #"," Other Salaries $/Autres salaires $","  Program Amount $/Somme pour dispenser le programme $","Furniture and Equipment $/Mobilier et équipement $","  Total $"]
["999999=+Form1!$C$8","999999=+Form1!$C$7","999999=+Form1!$C$25","999999=+Form1!$E$4","999999=+Form1!$C$37","999999=+Form1!$C$24","999999=+Form1!$C$26","999999=+Form1!$F$26","999999=+Form1!$C$27","999999=+Form1!$C$38","999999=+Form1!$C$39","999999=+Form1!$C$40","999999=+Form1!$C$17","999999=+Form1!$C$18","999999=+Form1!$F$18","999999=+Form1!$C$19","999999=+Form1!$C$20","999999=+Form1!$E$20","999999=+Form1!$C$64","999999=+Form1!$C$66","999999=+Form1!$C$65","999999=+Form1!$C$67","999999=+Form1!$C$68","999999=+Form1!$C$60","999999=+Form1!$C$69","999999=+Form1!$C$70","999999=+Form1!$C$71","999999=+Form1!$I$48","999999=+Form1!$I$49","999999=+Form1!$I$50","999999=+Form1!$I$55","999999=+Form1!$J$55","999999=+Form1!$I$60","999999=+Form1!$I$61","999999=+Form1!$C$78","999999=+Form1!$C$79","999999=+Form1!$C$82","999999=+Form1!$C$126","999999=Form1!$C$125","999999=Form1!$C$124","999999=Form1!$C$123","999999=+Form1!$C$95","999999=+Form1!$D$95","999999=+Form1!$C$96","999999=+Form1!$D$96","999999=+Form1!$C$97","999999=+Form1!$D$97","999999=+Form1!$D$98","999999=+Form1!$D$99","999999=+Form1!$D$100","999999=+Form1!$C$105","999999=+Form1!$D$105","999999=+Form1!$C$106","999999=+Form1!$D$106","999999=+Form1!$C$107","999999=+Form1!$D$107","999999=+Form1!$D$108","999999=+Form1!$D$109","999999=+Form1!$D$110","999999=+Form1!$E$95","999999=+Form1!$F$95","999999=+Form1!$E$96","999999=+Form1!$F$96","999999=+Form1!$E$97","999999=+Form1!$F$97","999999=+Form1!$F$98","999999=+Form1!$F$99","999999=+Form1!$F$100","999999=+Form1!$G$95","999999=+Form1!$H$95","999999=+Form1!$G$96","999999=+Form1!$H$96","999999=+Form1!$G$97","999999=+Form1!$H$97","999999=+Form1!$H$98","999999=+Form1!$H$99","999999=+Form1!$H$100",null,"999999=+Form1!$E$105","999999=+Form1!$F$105","999999=+Form1!$E$106","999999=+Form1!$F$106","999999=+Form1!$E$107","999999=+Form1!$F$107","999999=+Form1!$F$108","999999=+Form1!$F$109","999999=+Form1!$F$110","999999=+Form1!$G$105","999999=+Form1!$H$105","999999=+Form1!$G$106","999999=+Form1!$H$106","999999=+Form1!$G$107","999999=+Form1!$H$107","999999=+Form1!$H$108","999999=+Form1!$H$109","999999=+Form1!$H$110"]
["999999=+Form2!$C$8","999999=+Form2!$C$7","999999=+Form2!$C$25","999999=+Form2!$E$4","999999=+Form2!$C$37","999999=+Form2!$C$24","999999=+Form2!$C$26","999999=+Form2!$F$26","999999=+Form2!$C$27","999999=+Form2!$C$38","999999=+Form2!$C$39","999999=+Form2!$C$40","999999=+Form2!$C$17","999999=+Form2!$C$18","999999=+Form2!$F$18","999999=+Form2!$C$19","999999=+Form2!$C$20","999999=+Form2!$E$20","999999=+Form2!$C$64","999999=+Form2!$C$66","999999=+Form2!$C$65","999999=+Form2!$C$67","999999=+Form2!$C$68","999999=+Form2!$C$60","999999=+Form2!$C$69","999999=+Form2!$C$70","999999=+Form2!$C$71","999999=+Form2!$I$48","999999=+Form2!$I$49","999999=+Form2!$I$50","999999=+Form2!$I$55","999999=+Form2!$J$55","999999=+Form2!$I$60","999999=+Form2!$I$61","999999=+Form2!$C$78","999999=+Form2!$C$79","999999=+Form2!$C$82","999999=+Form2!$C$126","999999=+Form2!$C$125","999999=+Form2!$C$124","999999=+Form2!$C$123","999999=+Form2!$C$95","999999=+Form2!$D$95","999999=+Form2!$C$96","999999=+Form2!$D$96","999999=+Form2!$C$97","999999=+Form2!$D$97","999999=+Form2!$D$98","999999=+Form2!$D$99","999999=+Form2!$D$100","999999=+Form2!$C$105","999999=+Form2!$D$105","999999=+Form2!$C$106","999999=+Form2!$D$106","999999=+Form2!$C$107","999999=+Form2!$D$107","999999=+Form2!$D$108","999999=+Form2!$D$109","999999=+Form2!$D$110","999999=+Form2!$E$95","999999=+Form2!$F$95","999999=+Form2!$E$96","999999=+Form2!$F$96","999999=+Form2!$E$97","999999=+Form2!$F$97","999999=+Form2!$F$98","999999=+Form2!$F$99","999999=+Form2!$F$100","999999=+Form2!$G$95","999999=+Form2!$H$95","999999=+Form2!$G$96","999999=+Form2!$H$96","999999=+Form2!$G$97","999999=+Form2!$H$97","999999=+Form2!$H$98","999999=+Form2!$H$99","999999=+Form2!$H$100",null,"999999=+Form2!$E$105","999999=+Form2!$F$105","999999=+Form2!$E$106","999999=+Form2!$F$106","999999=+Form2!$E$107","999999=+Form2!$F$107","999999=+Form2!$F$108","999999=+Form2!$F$109","999999=+Form2!$F$110","999999=+Form2!$G$105","999999=+Form2!$H$105","999999=+Form2!$G$106","999999=+Form2!$H$106","999999=+Form2!$G$107","999999=+Form2!$H$107","999999=+Form2!$H$108","999999=+Form2!$H$109","999999=+Form2!$H$110"]
["999999=+Form3!$C$8","999999=+Form3!$C$7","999999=+Form3!$C$25","999999=+Form3!$E$4","999999=+Form3!$C$37","999999=+Form3!$C$24","999999=+Form3!$C$26","999999=+Form3!$F$26","999999=+Form3!$C$27","999999=+Form3!$C$38","999999=+Form3!$C$39","999999=+Form3!$C$40","999999=+Form3!$C$17","999999=+Form3!$C$18","999999=+Form3!$F$18","999999=+Form3!$C$19","999999=+Form3!$C$20","999999=+Form3!$E$20","999999=+Form3!$C$64","999999=+Form3!$C$66","999999=+Form3!$C$65","999999=+Form3!$C$67","999999=+Form3!$C$68","999999=+Form3!$C$60","999999=+Form3!$C$69","999999=+Form3!$C$70","999999=+Form3!$C$71","999999=+Form3!$I$48","999999=+Form3!$I$49","999999=+Form3!$I$50","999999=+Form3!$I$55","999999=+Form3!$J$55","999999=+Form3!$I$60","999999=+Form3!$I$61","999999=+Form3!$C$78","999999=+Form3!$C$79","999999=+Form3!$C$82","999999=+Form3!$C$126","999999=+Form3!$C$125","999999=+Form3!$C$124","999999=+Form3!$C$123","999999=+Form3!$C$95","999999=+Form3!$D$95","999999=+Form3!$C$96","999999=+Form3!$D$96","999999=+Form3!$C$97","999999=+Form3!$D$97","999999=+Form3!$D$98","999999=+Form3!$D$99","999999=+Form3!$D$100","999999=+Form3!$C$105","999999=+Form3!$D$105","999999=+Form3!$C$106","999999=+Form3!$D$106","999999=+Form3!$C$107","999999=+Form3!$D$107","999999=+Form3!$D$108","999999=+Form3!$D$109","999999=+Form3!$D$110","999999=+Form3!$E$95","999999=+Form3!$F$95","999999=+Form3!$E$96","999999=+Form3!$F$96","999999=+Form3!$E$97","999999=+Form3!$F$97","999999=+Form3!$F$98","999999=+Form3!$F$99","999999=+Form3!$F$100","999999=+Form3!$G$95","999999=+Form3!$H$95","999999=+Form3!$G$96","999999=+Form3!$H$96","999999=+Form3!$G$97","999999=+Form3!$H$97","999999=+Form3!$H$98","999999=+Form3!$H$99","999999=+Form3!$H$100",null,"999999=+Form3!$E$105","999999=+Form3!$F$105","999999=+Form3!$E$106","999999=+Form3!$F$106","999999=+Form3!$E$107","999999=+Form3!$F$107","999999=+Form3!$F$108","999999=+Form3!$F$109","999999=+Form3!$F$110","999999=+Form3!$G$105","999999=+Form3!$H$105","999999=+Form3!$G$106","999999=+Form3!$H$106","999999=+Form3!$G$107","999999=+Form3!$H$107","999999=+Form3!$H$108","999999=+Form3!$H$109","999999=+Form3!$H$110"]
["999999=+Form4!$C$8","999999=+Form4!$C$7","999999=+Form4!$C$25","999999=+Form4!$E$4","999999=+Form4!$C$37","999999=+Form4!$C$24","999999=+Form4!$C$26","999999=+Form4!$F$26","999999=+Form4!$C$27","999999=+Form4!$C$38","999999=+Form4!$C$39","999999=+Form4!$C$40","999999=+Form4!$C$17","999999=+Form4!$C$18","999999=+Form4!$F$18","999999=+Form4!$C$19","999999=+Form4!$C$20","999999=+Form4!$E$20","999999=+Form4!$C$64","999999=+Form4!$C$66","999999=+Form4!$C$65","999999=+Form4!$C$67","999999=+Form4!$C$68","999999=+Form4!$C$60","999999=+Form4!$C$69","999999=+Form4!$C$70","999999=+Form4!$C$71","999999=+Form4!$I$48","999999=+Form4!$I$49","999999=+Form4!$I$50","999999=+Form4!$I$55","999999=+Form4!$J$55","999999=+Form4!$I$60","999999=+Form4!$I$61","999999=+Form4!$C$78","999999=+Form4!$C$79","999999=+Form4!$C$82","999999=+Form4!$C$126","999999=+Form4!$C$125","999999=+Form4!$C$124","999999=+Form4!$C$123","999999=+Form4!$C$95","999999=+Form4!$D$95","999999=+Form4!$C$96","999999=+Form4!$D$96","999999=+Form4!$C$97","999999=+Form4!$D$97","999999=+Form4!$D$98","999999=+Form4!$D$99","999999=+Form4!$D$100","999999=+Form4!$C$105","999999=+Form4!$D$105","999999=+Form4!$C$106","999999=+Form4!$D$106","999999=+Form4!$C$107","999999=+Form4!$D$107","999999=+Form4!$D$108","999999=+Form4!$D$109","999999=+Form4!$D$110","999999=+Form4!$E$95","999999=+Form4!$F$95","999999=+Form4!$E$96","999999=+Form4!$F$96","999999=+Form4!$E$97","999999=+Form4!$F$97","999999=+Form4!$F$98","999999=+Form4!$F$99","999999=+Form4!$F$100","999999=+Form4!$G$95","999999=+Form4!$H$95","999999=+Form4!$G$96","999999=+Form4!$H$96","999999=+Form4!$G$97","999999=+Form4!$H$97","999999=+Form4!$H$98","999999=+Form4!$H$99","999999=+Form4!$H$100",null,"999999=+Form4!$E$105","999999=+Form4!$F$105","999999=+Form4!$E$106","999999=+Form4!$F$106","999999=+Form4!$E$107","999999=+Form4!$F$107","999999=+Form4!$F$108","999999=+Form4!$F$109","999999=+Form4!$F$110","999999=+Form4!$G$105","999999=+Form4!$H$105","999999=+Form4!$G$106","999999=+Form4!$H$106","999999=+Form4!$G$107","999999=+Form4!$H$107","999999=+Form4!$H$108","999999=+Form4!$H$109","999999=+Form4!$H$110"]
["999999=+Form5!$C$8","999999=+Form5!$C$7","999999=+Form5!$C$25","999999=+Form5!$E$4","999999=+Form5!$C$37","999999=+Form5!$C$24","999999=+Form5!$C$26","999999=+Form5!$F$26","999999=+Form5!$C$27","999999=+Form5!$C$38","999999=+Form5!$C$39","999999=+Form5!$C$40","999999=+Form5!$C$17","999999=+Form5!$C$18","999999=+Form5!$F$18","999999=+Form5!$C$19","999999=+Form5!$C$20","999999=+Form5!$E$20","999999=+Form5!$C$64","999999=+Form5!$C$66","999999=+Form5!$C$65","999999=+Form5!$C$67","999999=+Form5!$C$68","999999=+Form5!$C$60","999999=+Form5!$C$69","999999=+Form5!$C$70","999999=+Form5!$C$71","999999=+Form5!$I$48","999999=+Form5!$I$49","999999=+Form5!$I$50","999999=+Form5!$I$55","999999=+Form5!$J$55","999999=+Form5!$I$60","999999=+Form5!$I$61","999999=+Form5!$C$78","999999=+Form5!$C$79","999999=+Form5!$C$82","999999=+Form5!$C$126","999999=+Form5!$C$125","999999=+Form5!$C$124","999999=+Form5!$C$123","999999=+Form5!$C$95","999999=+Form5!$D$95","999999=+Form5!$C$96","999999=+Form5!$D$96","999999=+Form5!$C$97","999999=+Form5!$D$97","999999=+Form5!$D$98","999999=+Form5!$D$99","999999=+Form5!$D$100","999999=+Form5!$C$105","999999=+Form5!$D$105","999999=+Form5!$C$106","999999=+Form5!$D$106","999999=+Form5!$C$107","999999=+Form5!$D$107","999999=+Form5!$D$108","999999=+Form5!$D$109","999999=+Form5!$D$110","999999=+Form5!$E$95","999999=+Form5!$F$95","999999=+Form5!$E$96","999999=+Form5!$F$96","999999=+Form5!$E$97","999999=+Form5!$F$97","999999=+Form5!$F$98","999999=+Form5!$F$99","999999=+Form5!$F$100","999999=+Form5!$G$95","999999=+Form5!$H$95","999999=+Form5!$G$96","999999=+Form5!$H$96","999999=+Form5!$G$97","999999=+Form5!$H$97","999999=+Form5!$H$98","999999=+Form5!$H$99","999999=+Form5!$H$100",null,"999999=+Form5!$E$105","999999=+Form5!$F$105","999999=+Form5!$E$106","999999=+Form5!$F$106","999999=+Form5!$E$107","999999=+Form5!$F$107","999999=+Form5!$F$108","999999=+Form5!$F$109","999999=+Form5!$F$110","999999=+Form5!$G$105","999999=+Form5!$H$105","999999=+Form5!$G$106","999999=+Form5!$H$106","999999=+Form5!$G$107","999999=+Form5!$H$107","999999=+Form5!$H$108","999999=+Form5!$H$109","999999=+Form5!$H$110"]
["999999=+Form6!$C$8","999999=+Form6!$C$7","999999=+Form6!$C$25","999999=+Form6!$E$4","999999=+Form6!$C$37","999999=+Form6!$C$24","999999=+Form6!$C$26","999999=+Form6!$F$26","999999=+Form6!$C$27","999999=+Form6!$C$38","999999=+Form6!$C$39","999999=+Form6!$C$40","999999=+Form6!$C$17","999999=+Form6!$C$18","999999=+Form6!$F$18","999999=+Form6!$C$19","999999=+Form6!$C$20","999999=+Form6!$E$20","999999=+Form6!$C$64","999999=+Form6!$C$66","999999=+Form6!$C$65","999999=+Form6!$C$67","999999=+Form6!$C$68","999999=+Form6!$C$60","999999=+Form6!$C$69","999999=+Form6!$C$70","999999=+Form6!$C$71","999999=+Form6!$I$48","999999=+Form6!$I$49","999999=+Form6!$I$50","999999=+Form6!$I$55","999999=+Form6!$J$55","999999=+Form6!$I$60","999999=+Form6!$I$61","999999=+Form6!$C$78","999999=+Form6!$C$79","999999=+Form6!$C$82","999999=+Form6!$C$126","999999=+Form6!$C$125","999999=+Form6!$C$124","999999=+Form6!$C$123","999999=+Form6!$C$95","999999=+Form6!$D$95","999999=+Form6!$C$96","999999=+Form6!$D$96","999999=+Form6!$C$97","999999=+Form6!$D$97","999999=+Form6!$D$98","999999=+Form6!$D$99","999999=+Form6!$D$100","999999=+Form6!$C$105","999999=+Form6!$D$105","999999=+Form6!$C$106","999999=+Form6!$D$106","999999=+Form6!$C$107","999999=+Form6!$D$107","999999=+Form6!$D$108","999999=+Form6!$D$109","999999=+Form6!$D$110","999999=+Form6!$E$95","999999=+Form6!$F$95","999999=+Form6!$E$96","999999=+Form6!$F$96","999999=+Form6!$E$97","999999=+Form6!$F$97","999999=+Form6!$F$98","999999=+Form6!$F$99","999999=+Form6!$F$100","999999=+Form6!$G$95","999999=+Form6!$H$95","999999=+Form6!$G$96","999999=+Form6!$H$96","999999=+Form6!$G$97","999999=+Form6!$H$97","999999=+Form6!$H$98","999999=+Form6!$H$99","999999=+Form6!$H$100",null,"999999=+Form6!$E$105","999999=+Form6!$F$105","999999=+Form6!$E$106","999999=+Form6!$F$106","999999=+Form6!$E$107","999999=+Form6!$F$107","999999=+Form6!$F$108","999999=+Form6!$F$109","999999=+Form6!$F$110","999999=+Form6!$G$105","999999=+Form6!$H$105","999999=+Form6!$G$106","999999=+Form6!$H$106","999999=+Form6!$G$107","999999=+Form6!$H$107","999999=+Form6!$H$108","999999=+Form6!$H$109","999999=+Form6!$H$110"]
["999999=+Form7!$C$8","999999=+Form7!$C$7","999999=+Form7!$C$25","999999=+Form7!$E$4","999999=+Form7!$C$37","999999=+Form7!$C$24","999999=+Form7!$C$26","999999=+Form7!$F$26","999999=+Form7!$C$27","999999=+Form7!$C$38","999999=+Form7!$C$39","999999=+Form7!$C$40","999999=+Form7!$C$17","999999=+Form7!$C$18","999999=+Form7!$F$18","999999=+Form7!$C$19","999999=+Form7!$C$20","999999=+Form7!$E$20","999999=+Form7!$C$64","999999=+Form7!$C$66","999999=+Form7!$C$65","999999=+Form7!$C$67","999999=+Form7!$C$68","999999=+Form7!$C$60","999999=+Form7!$C$69","999999=+Form7!$C$70","999999=+Form7!$C$71","999999=+Form7!$I$48","999999=+Form7!$I$49","999999=+Form7!$I$50","999999=+Form7!$I$55","999999=+Form7!$J$55","999999=+Form7!$I$60","999999=+Form7!$I$61","999999=+Form7!$C$78","999999=+Form7!$C$79","999999=+Form7!$C$82","999999=+Form7!$C$126","999999=+Form7!$C$125","999999=+Form7!$C$124","999999=+Form7!$C$123","999999=+Form7!$C$95","999999=+Form7!$D$95","999999=+Form7!$C$96","999999=+Form7!$D$96","999999=+Form7!$C$97","999999=+Form7!$D$97","999999=+Form7!$D$98","999999=+Form7!$D$99","999999=+Form7!$D$100","999999=+Form7!$C$105","999999=+Form7!$D$105","999999=+Form7!$C$106","999999=+Form7!$D$106","999999=+Form7!$C$107","999999=+Form7!$D$107","999999=+Form7!$D$108","999999=+Form7!$D$109","999999=+Form7!$D$110","999999=+Form7!$E$95","999999=+Form7!$F$95","999999=+Form7!$E$96","999999=+Form7!$F$96","999999=+Form7!$E$97","999999=+Form7!$F$97","999999=+Form7!$F$98","999999=+Form7!$F$99","999999=+Form7!$F$100","999999=+Form7!$G$95","999999=+Form7!$H$95","999999=+Form7!$G$96","999999=+Form7!$H$96","999999=+Form7!$G$97","999999=+Form7!$H$97","999999=+Form7!$H$98","999999=+Form7!$H$99","999999=+Form7!$H$100",null,"999999=+Form7!$E$105","999999=+Form7!$F$105","999999=+Form7!$E$106","999999=+Form7!$F$106","999999=+Form7!$E$107","999999=+Form7!$F$107","999999=+Form7!$F$108","999999=+Form7!$F$109","999999=+Form7!$F$110","999999=+Form7!$G$105","999999=+Form7!$H$105","999999=+Form7!$G$106","999999=+Form7!$H$106","999999=+Form7!$G$107","999999=+Form7!$H$107","999999=+Form7!$H$108","999999=+Form7!$H$109","999999=+Form7!$H$110"]
["999999=+Form8!$C$8","999999=+Form8!$C$7","999999=+Form8!$C$25","999999=+Form8!$E$4","999999=+Form8!$C$37","999999=+Form8!$C$24","999999=+Form8!$C$26","999999=+Form8!$F$26","999999=+Form8!$C$27","999999=+Form8!$C$38","999999=+Form8!$C$39","999999=+Form8!$C$40","999999=+Form8!$C$17","999999=+Form8!$C$18","999999=+Form8!$F$18","999999=+Form8!$C$19","999999=+Form8!$C$20","999999=+Form8!$E$20","999999=+Form8!$C$64","999999=+Form8!$C$66","999999=+Form8!$C$65","999999=+Form8!$C$67","999999=+Form8!$C$68","999999=+Form8!$C$60","999999=+Form8!$C$69","999999=+Form8!$C$70","999999=+Form8!$C$71","999999=+Form8!$I$48","999999=+Form8!$I$49","999999=+Form8!$I$50","999999=+Form8!$I$55","999999=+Form8!$J$55","999999=+Form8!$I$60","999999=+Form8!$I$61","999999=+Form8!$C$78","999999=+Form8!$C$79","999999=+Form8!$C$82","999999=+Form8!$C$126","999999=+Form8!$C$125","999999=+Form8!$C$124","999999=+Form8!$C$123","999999=+Form8!$C$95","999999=+Form8!$D$95","999999=+Form8!$C$96","999999=+Form8!$D$96","999999=+Form8!$C$97","999999=+Form8!$D$97","999999=+Form8!$D$98","999999=+Form8!$D$99","999999=+Form8!$D$100","999999=+Form8!$C$105","999999=+Form8!$D$105","999999=+Form8!$C$106","999999=+Form8!$D$106","999999=+Form8!$C$107","999999=+Form8!$D$107","999999=+Form8!$D$108","999999=+Form8!$D$109","999999=+Form8!$D$110","999999=+Form8!$E$95","999999=+Form8!$F$95","999999=+Form8!$E$96","999999=+Form8!$F$96","999999=+Form8!$E$97","999999=+Form8!$F$97","999999=+Form8!$F$98","999999=+Form8!$F$99","999999=+Form8!$F$100","999999=+Form8!$G$95","999999=+Form8!$H$95","999999=+Form8!$G$96","999999=+Form8!$H$96","999999=+Form8!$G$97","999999=+Form8!$H$97","999999=+Form8!$H$98","999999=+Form8!$H$99","999999=+Form8!$H$100",null,"999999=+Form8!$E$105","999999=+Form8!$F$105","999999=+Form8!$E$106","999999=+Form8!$F$106","999999=+Form8!$E$107","999999=+Form8!$F$107","999999=+Form8!$F$108","999999=+Form8!$F$109","999999=+Form8!$F$110","999999=+Form8!$G$105","999999=+Form8!$H$105","999999=+Form8!$G$106","999999=+Form8!$H$106","999999=+Form8!$G$107","999999=+Form8!$H$107","999999=+Form8!$H$108","999999=+Form8!$H$109","999999=+Form8!$H$110"]
["999999=+Form9!$C$8","999999=+Form9!$C$7","999999=+Form9!$C$25","999999=+Form9!$E$4","999999=+Form9!$C$37","999999=+Form9!$C$24","999999=+Form9!$C$26","999999=+Form9!$F$26","999999=+Form9!$C$27","999999=+Form9!$C$38","999999=+Form9!$C$39","999999=+Form9!$C$40","999999=+Form9!$C$17","999999=+Form9!$C$18","999999=+Form9!$F$18","999999=+Form9!$C$19","999999=+Form9!$C$20","999999=+Form9!$E$20","999999=+Form9!$C$64","999999=+Form9!$C$66","999999=+Form9!$C$65","999999=+Form9!$C$67","999999=+Form9!$C$68","999999=+Form9!$C$60","999999=+Form9!$C$69","999999=+Form9!$C$70","999999=+Form9!$C$71","999999=+Form9!$I$48","999999=+Form9!$I$49","999999=+Form9!$I$50","999999=+Form9!$I$55","999999=+Form9!$J$55","999999=+Form9!$I$60","999999=+Form9!$I$61","999999=+Form9!$C$78","999999=+Form9!$C$79","999999=+Form9!$C$82","999999=+Form9!$C$126","999999=+Form9!$C$125","999999=+Form9!$C$124","999999=+Form9!$C$123","999999=+Form9!$C$95","999999=+Form9!$D$95","999999=+Form9!$C$96","999999=+Form9!$D$96","999999=+Form9!$C$97","999999=+Form9!$D$97","999999=+Form9!$D$98","999999=+Form9!$D$99","999999=+Form9!$D$100","999999=+Form9!$C$105","999999=+Form9!$D$105","999999=+Form9!$C$106","999999=+Form9!$D$106","999999=+Form9!$C$107","999999=+Form9!$D$107","999999=+Form9!$D$108","999999=+Form9!$D$109","999999=+Form9!$D$110","999999=+Form9!$E$95","999999=+Form9!$F$95","999999=+Form9!$E$96","999999=+Form9!$F$96","999999=+Form9!$E$97","999999=+Form9!$F$97","999999=+Form9!$F$98","999999=+Form9!$F$99","999999=+Form9!$F$100","999999=+Form9!$G$95","999999=+Form9!$H$95","999999=+Form9!$G$96","999999=+Form9!$H$96","999999=+Form9!$G$97","999999=+Form9!$H$97","999999=+Form9!$H$98","999999=+Form9!$H$99","999999=+Form9!$H$100",null,"999999=+Form9!$E$105","999999=+Form9!$F$105","999999=+Form9!$E$106","999999=+Form9!$F$106","999999=+Form9!$E$107","999999=+Form9!$F$107","999999=+Form9!$F$108","999999=+Form9!$F$109","999999=+Form9!$F$110","999999=+Form9!$G$105","999999=+Form9!$H$105","999999=+Form9!$G$106","999999=+Form9!$H$106","999999=+Form9!$G$107","999999=+Form9!$H$107","999999=+Form9!$H$108","999999=+Form9!$H$109","999999=+Form9!$H$110"]
["999999=+Form10!$C$8","999999=+Form10!$C$7","999999=+Form10!$C$25","999999=+Form10!$E$4","999999=+Form10!$C$37","999999=+Form10!$C$24","999999=+Form10!$C$26","999999=+Form10!$F$26","999999=+Form10!$C$27","999999=+Form10!$C$38","999999=+Form10!$C$39","999999=+Form10!$C$40","999999=+Form10!$C$17","999999=+Form10!$C$18","999999=+Form10!$F$18","999999=+Form10!$C$19","999999=+Form10!$C$20","999999=+Form10!$E$20","999999=+Form10!$C$64","999999=+Form10!$C$66","999999=+Form10!$C$65","999999=+Form10!$C$67","999999=+Form10!$C$68","999999=+Form10!$C$60","999999=+Form10!$C$69","999999=+Form10!$C$70","999999=+Form10!$C$71","999999=+Form10!$I$48","999999=+Form10!$I$49","999999=+Form10!$I$50","999999=+Form10!$I$55","999999=+Form10!$J$55","999999=+Form10!$I$60","999999=+Form10!$I$61","999999=+Form10!$C$78","999999=+Form10!$C$79","999999=+Form10!$C$82","999999=+Form10!$C$126","999999=+Form10!$C$125","999999=+Form10!$C$124","999999=+Form10!$C$123","999999=+Form10!$C$95","999999=+Form10!$D$95","999999=+Form10!$C$96","999999=+Form10!$D$96","999999=+Form10!$C$97","999999=+Form10!$D$97","999999=+Form10!$D$98","999999=+Form10!$D$99","999999=+Form10!$D$100","999999=+Form10!$C$105","999999=+Form10!$D$105","999999=+Form10!$C$106","999999=+Form10!$D$106","999999=+Form10!$C$107","999999=+Form10!$D$107","999999=+Form10!$D$108","999999=+Form10!$D$109","999999=+Form10!$D$110","999999=+Form10!$E$95","999999=+Form10!$F$95","999999=+Form10!$E$96","999999=+Form10!$F$96","999999=+Form10!$E$97","999999=+Form10!$F$97","999999=+Form10!$F$98","999999=+Form10!$F$99","999999=+Form10!$F$100","999999=+Form10!$G$95","999999=+Form10!$H$95","999999=+Form10!$G$96","999999=+Form10!$H$96","999999=+Form10!$G$97","999999=+Form10!$H$97","999999=+Form10!$H$98","999999=+Form10!$H$99","999999=+Form10!$H$100",null,"999999=+Form10!$E$105","999999=+Form10!$F$105","999999=+Form10!$E$106","999999=+Form10!$F$106","999999=+Form10!$E$107","999999=+Form10!$F$107","999999=+Form10!$F$108","999999=+Form10!$F$109","999999=+Form10!$F$110","999999=+Form10!$G$105","999999=+Form10!$H$105","999999=+Form10!$G$106","999999=+Form10!$H$106","999999=+Form10!$G$107","999999=+Form10!$H$107","999999=+Form10!$H$108","999999=+Form10!$H$109","999999=+Form10!$H$110"]
["999999=+Form11!$C$8","999999=+Form11!$C$7","999999=+Form11!$C$25","999999=+Form11!$E$4","999999=+Form11!$C$37","999999=+Form11!$C$24","999999=+Form11!$C$26","999999=+Form11!$F$26","999999=+Form11!$C$27","999999=+Form11!$C$38","999999=+Form11!$C$39","999999=+Form11!$C$40","999999=+Form11!$C$17","999999=+Form11!$C$18","999999=+Form11!$F$18","999999=+Form11!$C$19","999999=+Form11!$C$20","999999=+Form11!$E$20","999999=+Form11!$C$64","999999=+Form11!$C$66","999999=+Form11!$C$65","999999=+Form11!$C$67","999999=+Form11!$C$68","999999=+Form11!$C$60","999999=+Form11!$C$69","999999=+Form11!$C$70","999999=+Form11!$C$71","999999=+Form11!$I$48","999999=+Form11!$I$49","999999=+Form11!$I$50","999999=+Form11!$I$55","999999=+Form11!$J$55","999999=+Form11!$I$60","999999=+Form11!$I$61","999999=+Form11!$C$78","999999=+Form11!$C$79","999999=+Form11!$C$82","999999=+Form11!$C$126","999999=+Form11!$C$125","999999=+Form11!$C$124","999999=+Form11!$C$123","999999=+Form11!$C$95","999999=+Form11!$D$95","999999=+Form11!$C$96","999999=+Form11!$D$96","999999=+Form11!$C$97","999999=+Form11!$D$97","999999=+Form11!$D$98","999999=+Form11!$D$99","999999=+Form11!$D$100","999999=+Form11!$C$105","999999=+Form11!$D$105","999999=+Form11!$C$106","999999=+Form11!$D$106","999999=+Form11!$C$107","999999=+Form11!$D$107","999999=+Form11!$D$108","999999=+Form11!$D$109","999999=+Form11!$D$110","999999=+Form11!$E$95","999999=+Form11!$F$95","999999=+Form11!$E$96","999999=+Form11!$F$96","999999=+Form11!$E$97","999999=+Form11!$F$97","999999=+Form11!$F$98","999999=+Form11!$F$99","999999=+Form11!$F$100","999999=+Form11!$G$95","999999=+Form11!$H$95","999999=+Form11!$G$96","999999=+Form11!$H$96","999999=+Form11!$G$97","999999=+Form11!$H$97","999999=+Form11!$H$98","999999=+Form11!$H$99","999999=+Form11!$H$100",null,"999999=+Form11!$E$105","999999=+Form11!$F$105","999999=+Form11!$E$106","999999=+Form11!$F$106","999999=+Form11!$E$107","999999=+Form11!$F$107","999999=+Form11!$F$108","999999=+Form11!$F$109","999999=+Form11!$F$110","999999=+Form11!$G$105","999999=+Form11!$H$105","999999=+Form11!$G$106","999999=+Form11!$H$106","999999=+Form11!$G$107","999999=+Form11!$H$107","999999=+Form11!$H$108","999999=+Form11!$H$109","999999=+Form11!$H$110"]
["999999=+Form12!$C$8","999999=+Form12!$C$7","999999=+Form12!$C$25","999999=+Form12!$E$4","999999=+Form12!$C$37","999999=+Form12!$C$24","999999=+Form12!$C$26","999999=+Form12!$F$26","999999=+Form12!$C$27","999999=+Form12!$C$38","999999=+Form12!$C$39","999999=+Form12!$C$40","999999=+Form12!$C$17","999999=+Form12!$C$18","999999=+Form12!$F$18","999999=+Form12!$C$19","999999=+Form12!$C$20","999999=+Form12!$E$20","999999=+Form12!$C$64","999999=+Form12!$C$66","999999=+Form12!$C$65","999999=+Form12!$C$67","999999=+Form12!$C$68","999999=+Form12!$C$60","999999=+Form12!$C$69","999999=+Form12!$C$70","999999=+Form12!$C$71","999999=+Form12!$I$48","999999=+Form12!$I$49","999999=+Form12!$I$50","999999=+Form12!$I$55","999999=+Form12!$J$55","999999=+Form12!$I$60","999999=+Form12!$I$61","999999=+Form12!$C$78","999999=+Form12!$C$79","999999=+Form12!$C$82","999999=+Form12!$C$126","999999=+Form12!$C$125","999999=+Form12!$C$124","999999=+Form12!$C$123","999999=+Form12!$C$95","999999=+Form12!$D$95","999999=+Form12!$C$96","999999=+Form12!$D$96","999999=+Form12!$C$97","999999=+Form12!$D$97","999999=+Form12!$D$98","999999=+Form12!$D$99","999999=+Form12!$D$100","999999=+Form12!$C$105","999999=+Form12!$D$105","999999=+Form12!$C$106","999999=+Form12!$D$106","999999=+Form12!$C$107","999999=+Form12!$D$107","999999=+Form12!$D$108","999999=+Form12!$D$109","999999=+Form12!$D$110","999999=+Form12!$E$95","999999=+Form12!$F$95","999999=+Form12!$E$96","999999=+Form12!$F$96","999999=+Form12!$E$97","999999=+Form12!$F$97","999999=+Form12!$F$98","999999=+Form12!$F$99","999999=+Form12!$F$100","999999=+Form12!$G$95","999999=+Form12!$H$95","999999=+Form12!$G$96","999999=+Form12!$H$96","999999=+Form12!$G$97","999999=+Form12!$H$97","999999=+Form12!$H$98","999999=+Form12!$H$99","999999=+Form12!$H$100",null,"999999=+Form12!$E$105","999999=+Form12!$F$105","999999=+Form12!$E$106","999999=+Form12!$F$106","999999=+Form12!$E$107","999999=+Form12!$F$107","999999=+Form12!$F$108","999999=+Form12!$F$109","999999=+Form12!$F$110","999999=+Form12!$G$105","999999=+Form12!$H$105","999999=+Form12!$G$106","999999=+Form12!$H$106","999999=+Form12!$G$107","999999=+Form12!$H$107","999999=+Form12!$H$108","999999=+Form12!$H$109","999999=+Form12!$H$110"]
["999999=+Form13!$C$8","999999=+Form13!$C$7","999999=+Form13!$C$25","999999=+Form13!$E$4","999999=+Form13!$C$37","999999=+Form13!$C$24","999999=+Form13!$C$26","999999=+Form13!$F$26","999999=+Form13!$C$27","999999=+Form13!$C$38","999999=+Form13!$C$39","999999=+Form13!$C$40","999999=+Form13!$C$17","999999=+Form13!$C$18","999999=+Form13!$F$18","999999=+Form13!$C$19","999999=+Form13!$C$20","999999=+Form13!$E$20","999999=+Form13!$C$64","999999=+Form13!$C$66","999999=+Form13!$C$65","999999=+Form13!$C$67","999999=+Form13!$C$68","999999=+Form13!$C$60","999999=+Form13!$C$69","999999=+Form13!$C$70","999999=+Form13!$C$71","999999=+Form13!$I$48","999999=+Form13!$I$49","999999=+Form13!$I$50","999999=+Form13!$I$55","999999=+Form13!$J$55","999999=+Form13!$I$60","999999=+Form13!$I$61","999999=+Form13!$C$78","999999=+Form13!$C$79","999999=+Form13!$C$82","999999=+Form13!$C$126","999999=+Form13!$C$125","999999=+Form13!$C$124","999999=+Form13!$C$123","999999=+Form13!$C$95","999999=+Form13!$D$95","999999=+Form13!$C$96","999999=+Form13!$D$96","999999=+Form13!$C$97","999999=+Form13!$D$97","999999=+Form13!$D$98","999999=+Form13!$D$99","999999=+Form13!$D$100","999999=+Form13!$C$105","999999=+Form13!$D$105","999999=+Form13!$C$106","999999=+Form13!$D$106","999999=+Form13!$C$107","999999=+Form13!$D$107","999999=+Form13!$D$108","999999=+Form13!$D$109","999999=+Form13!$D$110","999999=+Form13!$E$95","999999=+Form13!$F$95","999999=+Form13!$E$96","999999=+Form13!$F$96","999999=+Form13!$E$97","999999=+Form13!$F$97","999999=+Form13!$F$98","999999=+Form13!$F$99","999999=+Form13!$F$100","999999=+Form13!$G$95","999999=+Form13!$H$95","999999=+Form13!$G$96","999999=+Form13!$H$96","999999=+Form13!$G$97","999999=+Form13!$H$97","999999=+Form13!$H$98","999999=+Form13!$H$99","999999=+Form13!$H$100",null,"999999=+Form13!$E$105","999999=+Form13!$F$105","999999=+Form13!$E$106","999999=+Form13!$F$106","999999=+Form13!$E$107","999999=+Form13!$F$107","999999=+Form13!$F$108","999999=+Form13!$F$109","999999=+Form13!$F$110","999999=+Form13!$G$105","999999=+Form13!$H$105","999999=+Form13!$G$106","999999=+Form13!$H$106","999999=+Form13!$G$107","999999=+Form13!$H$107","999999=+Form13!$H$108","999999=+Form13!$H$109","999999=+Form13!$H$110"]
["999999=+Form14!$C$8","999999=+Form14!$C$7","999999=+Form14!$C$25","999999=+Form14!$E$4","999999=+Form14!$C$37","999999=+Form14!$C$24","999999=+Form14!$C$26","999999=+Form14!$F$26","999999=+Form14!$C$27","999999=+Form14!$C$38","999999=+Form14!$C$39","999999=+Form14!$C$40","999999=+Form14!$C$17","999999=+Form14!$C$18","999999=+Form14!$F$18","999999=+Form14!$C$19","999999=+Form14!$C$20","999999=+Form14!$E$20","999999=+Form14!$C$64","999999=+Form14!$C$66","999999=+Form14!$C$65","999999=+Form14!$C$67","999999=+Form14!$C$68","999999=+Form14!$C$60","999999=+Form14!$C$69","999999=+Form14!$C$70","999999=+Form14!$C$71","999999=+Form14!$I$48","999999=+Form14!$I$49","999999=+Form14!$I$50","999999=+Form14!$I$55","999999=+Form14!$J$55","999999=+Form14!$I$60","999999=+Form14!$I$61","999999=+Form14!$C$78","999999=+Form14!$C$79","999999=+Form14!$C$82","999999=+Form14!$C$126","999999=+Form14!$C$125","999999=+Form14!$C$124","999999=+Form14!$C$123","999999=+Form14!$C$95","999999=+Form14!$D$95","999999=+Form14!$C$96","999999=+Form14!$D$96","999999=+Form14!$C$97","999999=+Form14!$D$97","999999=+Form14!$D$98","999999=+Form14!$D$99","999999=+Form14!$D$100","999999=+Form14!$C$105","999999=+Form14!$D$105","999999=+Form14!$C$106","999999=+Form14!$D$106","999999=+Form14!$C$107","999999=+Form14!$D$107","999999=+Form14!$D$108","999999=+Form14!$D$109","999999=+Form14!$D$110","999999=+Form14!$E$95","999999=+Form14!$F$95","999999=+Form14!$E$96","999999=+Form14!$F$96","999999=+Form14!$E$97","999999=+Form14!$F$97","999999=+Form14!$F$98","999999=+Form14!$F$99","999999=+Form14!$F$100","999999=+Form14!$G$95","999999=+Form14!$H$95","999999=+Form14!$G$96","999999=+Form14!$H$96","999999=+Form14!$G$97","999999=+Form14!$H$97","999999=+Form14!$H$98","999999=+Form14!$H$99","999999=+Form14!$H$100",null,"999999=+Form14!$E$105","999999=+Form14!$F$105","999999=+Form14!$E$106","999999=+Form14!$F$106","999999=+Form14!$E$107","999999=+Form14!$F$107","999999=+Form14!$F$108","999999=+Form14!$F$109","999999=+Form14!$F$110","999999=+Form14!$G$105","999999=+Form14!$H$105","999999=+Form14!$G$106","999999=+Form14!$H$106","999999=+Form14!$G$107","999999=+Form14!$H$107","999999=+Form14!$H$108","999999=+Form14!$H$109","999999=+Form14!$H$110"]
["999999=+Form15!$C$8","999999=+Form15!$C$7","999999=+Form15!$C$25","999999=+Form15!$E$4","999999=+Form15!$C$37","999999=+Form15!$C$24","999999=+Form15!$C$26","999999=+Form15!$F$26","999999=+Form15!$C$27","999999=+Form15!$C$38","999999=+Form15!$C$39","999999=+Form15!$C$40","999999=+Form15!$C$17","999999=+Form15!$C$18","999999=+Form15!$F$18","999999=+Form15!$C$19","999999=+Form15!$C$20","999999=+Form15!$E$20","999999=+Form15!$C$64","999999=+Form15!$C$66","999999=+Form15!$C$65","999999=+Form15!$C$67","999999=+Form15!$C$68","999999=+Form15!$C$60","999999=+Form15!$C$69","999999=+Form15!$C$70","999999=+Form15!$C$71","999999=+Form15!$I$48","999999=+Form15!$I$49","999999=+Form15!$I$50","999999=+Form15!$I$55","999999=+Form15!$J$55","999999=+Form15!$I$60","999999=+Form15!$I$61","999999=+Form15!$C$78","999999=+Form15!$C$79","999999=+Form15!$C$82","999999=+Form15!$C$126","999999=+Form15!$C$125","999999=+Form15!$C$124","999999=+Form15!$C$123","999999=+Form15!$C$95","999999=+Form15!$D$95","999999=+Form15!$C$96","999999=+Form15!$D$96","999999=+Form15!$C$97","999999=+Form15!$D$97","999999=+Form15!$D$98","999999=+Form15!$D$99","999999=+Form15!$D$100","999999=+Form15!$C$105","999999=+Form15!$D$105","999999=+Form15!$C$106","999999=+Form15!$D$106","999999=+Form15!$C$107","999999=+Form15!$D$107","999999=+Form15!$D$108","999999=+Form15!$D$109","999999=+Form15!$D$110","999999=+Form15!$E$95","999999=+Form15!$F$95","999999=+Form15!$E$96","999999=+Form15!$F$96","999999=+Form15!$E$97","999999=+Form15!$F$97","999999=+Form15!$F$98","999999=+Form15!$F$99","999999=+Form15!$F$100","999999=+Form15!$G$95","999999=+Form15!$H$95","999999=+Form15!$G$96","999999=+Form15!$H$96","999999=+Form15!$G$97","999999=+Form15!$H$97","999999=+Form15!$H$98","999999=+Form15!$H$99","999999=+Form15!$H$100",null,"999999=+Form15!$E$105","999999=+Form15!$F$105","999999=+Form15!$E$106","999999=+Form15!$F$106","999999=+Form15!$E$107","999999=+Form15!$F$107","999999=+Form15!$F$108","999999=+Form15!$F$109","999999=+Form15!$F$110","999999=+Form15!$G$105","999999=+Form15!$H$105","999999=+Form15!$G$106","999999=+Form15!$H$106","999999=+Form15!$G$107","999999=+Form15!$H$107","999999=+Form15!$H$108","999999=+Form15!$H$109","999999=+Form15!$H$110"]
["999999=+Form16!$C$8","999999=+Form16!$C$7","999999=+Form16!$C$25","999999=+Form16!$E$4","999999=+Form16!$C$37","999999=+Form16!$C$24","999999=+Form16!$C$26","999999=+Form16!$F$26","999999=+Form16!$C$27","999999=+Form16!$C$38","999999=+Form16!$C$39","999999=+Form16!$C$40","999999=+Form16!$C$17","999999=+Form16!$C$18","999999=+Form16!$F$18","999999=+Form16!$C$19","999999=+Form16!$C$20","999999=+Form16!$E$20","999999=+Form16!$C$64","999999=+Form16!$C$66","999999=+Form16!$C$65","999999=+Form16!$C$67","999999=+Form16!$C$68","999999=+Form16!$C$60","999999=+Form16!$C$69","999999=+Form16!$C$70","999999=+Form16!$C$71","999999=+Form16!$I$48","999999=+Form16!$I$49","999999=+Form16!$I$50","999999=+Form16!$I$55","999999=+Form16!$J$55","999999=+Form16!$I$60","999999=+Form16!$I$61","999999=+Form16!$C$78","999999=+Form16!$C$79","999999=+Form16!$C$82","999999=+Form16!$C$126","999999=+Form16!$C$125","999999=+Form16!$C$124","999999=+Form16!$C$123","999999=+Form16!$C$95","999999=+Form16!$D$95","999999=+Form16!$C$96","999999=+Form16!$D$96","999999=+Form16!$C$97","999999=+Form16!$D$97","999999=+Form16!$D$98","999999=+Form16!$D$99","999999=+Form16!$D$100","999999=+Form16!$C$105","999999=+Form16!$D$105","999999=+Form16!$C$106","999999=+Form16!$D$106","999999=+Form16!$C$107","999999=+Form16!$D$107","999999=+Form16!$D$108","999999=+Form16!$D$109","999999=+Form16!$D$110","999999=+Form16!$E$95","999999=+Form16!$F$95","999999=+Form16!$E$96","999999=+Form16!$F$96","999999=+Form16!$E$97","999999=+Form16!$F$97","999999=+Form16!$F$98","999999=+Form16!$F$99","999999=+Form16!$F$100","999999=+Form16!$G$95","999999=+Form16!$H$95","999999=+Form16!$G$96","999999=+Form16!$H$96","999999=+Form16!$G$97","999999=+Form16!$H$97","999999=+Form16!$H$98","999999=+Form16!$H$99","999999=+Form16!$H$100",null,"999999=+Form16!$E$105","999999=+Form16!$F$105","999999=+Form16!$E$106","999999=+Form16!$F$106","999999=+Form16!$E$107","999999=+Form16!$F$107","999999=+Form16!$F$108","999999=+Form16!$F$109","999999=+Form16!$F$110","999999=+Form16!$G$105","999999=+Form16!$H$105","999999=+Form16!$G$106","999999=+Form16!$H$106","999999=+Form16!$G$107","999999=+Form16!$H$107","999999=+Form16!$H$108","999999=+Form16!$H$109","999999=+Form16!$H$110"]
["999999=+Form17!$C$8","999999=+Form17!$C$7","999999=+Form17!$C$25","999999=+Form17!$E$4","999999=+Form17!$C$37","999999=+Form17!$C$24","999999=+Form17!$C$26","999999=+Form17!$F$26","999999=+Form17!$C$27","999999=+Form17!$C$38","999999=+Form17!$C$39","999999=+Form17!$C$40","999999=+Form17!$C$17","999999=+Form17!$C$18","999999=+Form17!$F$18","999999=+Form17!$C$19","999999=+Form17!$C$20","999999=+Form17!$E$20","999999=+Form17!$C$64","999999=+Form17!$C$66","999999=+Form17!$C$65","999999=+Form17!$C$67","999999=+Form17!$C$68","999999=+Form17!$C$60","999999=+Form17!$C$69","999999=+Form17!$C$70","999999=+Form17!$C$71","999999=+Form17!$I$48","999999=+Form17!$I$49","999999=+Form17!$I$50","999999=+Form17!$I$55","999999=+Form17!$J$55","999999=+Form17!$I$60","999999=+Form17!$I$61","999999=+Form17!$C$78","999999=+Form17!$C$79","999999=+Form17!$C$82","999999=+Form17!$C$126","999999=+Form17!$C$125","999999=+Form17!$C$124","999999=+Form17!$C$123","999999=+Form17!$C$95","999999=+Form17!$D$95","999999=+Form17!$C$96","999999=+Form17!$D$96","999999=+Form17!$C$97","999999=+Form17!$D$97","999999=+Form17!$D$98","999999=+Form17!$D$99","999999=+Form17!$D$100","999999=+Form17!$C$105","999999=+Form17!$D$105","999999=+Form17!$C$106","999999=+Form17!$D$106","999999=+Form17!$C$107","999999=+Form17!$D$107","999999=+Form17!$D$108","999999=+Form17!$D$109","999999=+Form17!$D$110","999999=+Form17!$E$95","999999=+Form17!$F$95","999999=+Form17!$E$96","999999=+Form17!$F$96","999999=+Form17!$E$97","999999=+Form17!$F$97","999999=+Form17!$F$98","999999=+Form17!$F$99","999999=+Form17!$F$100","999999=+Form17!$G$95","999999=+Form17!$H$95","999999=+Form17!$G$96","999999=+Form17!$H$96","999999=+Form17!$G$97","999999=+Form17!$H$97","999999=+Form17!$H$98","999999=+Form17!$H$99","999999=+Form17!$H$100",null,"999999=+Form17!$E$105","999999=+Form17!$F$105","999999=+Form17!$E$106","999999=+Form17!$F$106","999999=+Form17!$E$107","999999=+Form17!$F$107","999999=+Form17!$F$108","999999=+Form17!$F$109","999999=+Form17!$F$110","999999=+Form17!$G$105","999999=+Form17!$H$105","999999=+Form17!$G$106","999999=+Form17!$H$106","999999=+Form17!$G$107","999999=+Form17!$H$107","999999=+Form17!$H$108","999999=+Form17!$H$109","999999=+Form17!$H$110"]
["999999=+Form18!$C$8","999999=+Form18!$C$7","999999=+Form18!$C$25","999999=+Form18!$E$4","999999=+Form18!$C$37","999999=+Form18!$C$24","999999=+Form18!$C$26","999999=+Form18!$F$26","999999=+Form18!$C$27","999999=+Form18!$C$38","999999=+Form18!$C$39","999999=+Form18!$C$40","999999=+Form18!$C$17","999999=+Form18!$C$18","999999=+Form18!$F$18","999999=+Form18!$C$19","999999=+Form18!$C$20","999999=+Form18!$E$20","999999=+Form18!$C$64","999999=+Form18!$C$66","999999=+Form18!$C$65","999999=+Form18!$C$67","999999=+Form18!$C$68","999999=+Form18!$C$60","999999=+Form18!$C$69","999999=+Form18!$C$70","999999=+Form18!$C$71","999999=+Form18!$I$48","999999=+Form18!$I$49","999999=+Form18!$I$50","999999=+Form18!$I$55","999999=+Form18!$J$55","999999=+Form18!$I$60","999999=+Form18!$I$61","999999=+Form18!$C$78","999999=+Form18!$C$79","999999=+Form18!$C$82","999999=+Form18!$C$126","999999=+Form18!$C$125","999999=+Form18!$C$124","999999=+Form18!$C$123","999999=+Form18!$C$95","999999=+Form18!$D$95","999999=+Form18!$C$96","999999=+Form18!$D$96","999999=+Form18!$C$97","999999=+Form18!$D$97","999999=+Form18!$D$98","999999=+Form18!$D$99","999999=+Form18!$D$100","999999=+Form18!$C$105","999999=+Form18!$D$105","999999=+Form18!$C$106","999999=+Form18!$D$106","999999=+Form18!$C$107","999999=+Form18!$D$107","999999=+Form18!$D$108","999999=+Form18!$D$109","999999=+Form18!$D$110","999999=+Form18!$E$95","999999=+Form18!$F$95","999999=+Form18!$E$96","999999=+Form18!$F$96","999999=+Form18!$E$97","999999=+Form18!$F$97","999999=+Form18!$F$98","999999=+Form18!$F$99","999999=+Form18!$F$100","999999=+Form18!$G$95","999999=+Form18!$H$95","999999=+Form18!$G$96","999999=+Form18!$H$96","999999=+Form18!$G$97","999999=+Form18!$H$97","999999=+Form18!$H$98","999999=+Form18!$H$99","999999=+Form18!$H$100",null,"999999=+Form18!$E$105","999999=+Form18!$F$105","999999=+Form18!$E$106","999999=+Form18!$F$106","999999=+Form18!$E$107","999999=+Form18!$F$107","999999=+Form18!$F$108","999999=+Form18!$F$109","999999=+Form18!$F$110","999999=+Form18!$G$105","999999=+Form18!$H$105","999999=+Form18!$G$106","999999=+Form18!$H$106","999999=+Form18!$G$107","999999=+Form18!$H$107","999999=+Form18!$H$108","999999=+Form18!$H$109","999999=+Form18!$H$110"]
["999999=+Form19!$C$8","999999=+Form19!$C$7","999999=+Form19!$C$25","999999=+Form19!$E$4","999999=+Form19!$C$37","999999=+Form19!$C$24","999999=+Form19!$C$26","999999=+Form19!$F$26","999999=+Form19!$C$27","999999=+Form19!$C$38","999999=+Form19!$C$39","999999=+Form19!$C$40","999999=+Form19!$C$17","999999=+Form19!$C$18","999999=+Form19!$F$18","999999=+Form19!$C$19","999999=+Form19!$C$20","999999=+Form19!$E$20","999999=+Form19!$C$64","999999=+Form19!$C$66","999999=+Form19!$C$65","999999=+Form19!$C$67","999999=+Form19!$C$68","999999=+Form19!$C$60","999999=+Form19!$C$69","999999=+Form19!$C$70","999999=+Form19!$C$71","999999=+Form19!$I$48","999999=+Form19!$I$49","999999=+Form19!$I$50","999999=+Form19!$I$55","999999=+Form19!$J$55","999999=+Form19!$I$60","999999=+Form19!$I$61","999999=+Form19!$C$78","999999=+Form19!$C$79","999999=+Form19!$C$82","999999=+Form19!$C$126","999999=+Form19!$C$125","999999=+Form19!$C$124","999999=+Form19!$C$123","999999=+Form19!$C$95","999999=+Form19!$D$95","999999=+Form19!$C$96","999999=+Form19!$D$96","999999=+Form19!$C$97","999999=+Form19!$D$97","999999=+Form19!$D$98","999999=+Form19!$D$99","999999=+Form19!$D$100","999999=+Form19!$C$105","999999=+Form19!$D$105","999999=+Form19!$C$106","999999=+Form19!$D$106","999999=+Form19!$C$107","999999=+Form19!$D$107","999999=+Form19!$D$108","999999=+Form19!$D$109","999999=+Form19!$D$110","999999=+Form19!$E$95","999999=+Form19!$F$95","999999=+Form19!$E$96","999999=+Form19!$F$96","999999=+Form19!$E$97","999999=+Form19!$F$97","999999=+Form19!$F$98","999999=+Form19!$F$99","999999=+Form19!$F$100","999999=+Form19!$G$95","999999=+Form19!$H$95","999999=+Form19!$G$96","999999=+Form19!$H$96","999999=+Form19!$G$97","999999=+Form19!$H$97","999999=+Form19!$H$98","999999=+Form19!$H$99","999999=+Form19!$H$100",null,"999999=+Form19!$E$105","999999=+Form19!$F$105","999999=+Form19!$E$106","999999=+Form19!$F$106","999999=+Form19!$E$107","999999=+Form19!$F$107","999999=+Form19!$F$108","999999=+Form19!$F$109","999999=+Form19!$F$110","999999=+Form19!$G$105","999999=+Form19!$H$105","999999=+Form19!$G$106","999999=+Form19!$H$106","999999=+Form19!$G$107","999999=+Form19!$H$107","999999=+Form19!$H$108","999999=+Form19!$H$109","999999=+Form19!$H$110"]
["999999=+Form20!$C$8","999999=+Form20!$C$7","999999=+Form20!$C$25","999999=+Form20!$E$4","999999=+Form20!$C$37","999999=+Form20!$C$24","999999=+Form20!$C$26","999999=+Form20!$F$26","999999=+Form20!$C$27","999999=+Form20!$C$38","999999=+Form20!$C$39","999999=+Form20!$C$40","999999=+Form20!$C$17","999999=+Form20!$C$18","999999=+Form20!$F$18","999999=+Form20!$C$19","999999=+Form20!$C$20","999999=+Form20!$E$20","999999=+Form20!$C$64","999999=+Form20!$C$66","999999=+Form20!$C$65","999999=+Form20!$C$67","999999=+Form20!$C$68","999999=+Form20!$C$60","999999=+Form20!$C$69","999999=+Form20!$C$70","999999=+Form20!$C$71","999999=+Form20!$I$48","999999=+Form20!$I$49","999999=+Form20!$I$50","999999=+Form20!$I$55","999999=+Form20!$J$55","999999=+Form20!$I$60","999999=+Form20!$I$61","999999=+Form20!$C$78","999999=+Form20!$C$79","999999=+Form20!$C$82","999999=+Form20!$C$126","999999=+Form20!$C$125","999999=+Form20!$C$124","999999=+Form20!$C$123","999999=+Form20!$C$95","999999=+Form20!$D$95","999999=+Form20!$C$96","999999=+Form20!$D$96","999999=+Form20!$C$97","999999=+Form20!$D$97","999999=+Form20!$D$98","999999=+Form20!$D$99","999999=+Form20!$D$100","999999=+Form20!$C$105","999999=+Form20!$D$105","999999=+Form20!$C$106","999999=+Form20!$D$106","999999=+Form20!$C$107","999999=+Form20!$D$107","999999=+Form20!$D$108","999999=+Form20!$D$109","999999=+Form20!$D$110","999999=+Form20!$E$95","999999=+Form20!$F$95","999999=+Form20!$E$96","999999=+Form20!$F$96","999999=+Form20!$E$97","999999=+Form20!$F$97","999999=+Form20!$F$98","999999=+Form20!$F$99","999999=+Form20!$F$100","999999=+Form20!$G$95","999999=+Form20!$H$95","999999=+Form20!$G$96","999999=+Form20!$H$96","999999=+Form20!$G$97","999999=+Form20!$H$97","999999=+Form20!$H$98","999999=+Form20!$H$99","999999=+Form20!$H$100",null,"999999=+Form20!$E$105","999999=+Form20!$F$105","999999=+Form20!$E$106","999999=+Form20!$F$106","999999=+Form20!$E$107","999999=+Form20!$F$107","999999=+Form20!$F$108","999999=+Form20!$F$109","999999=+Form20!$F$110","999999=+Form20!$G$105","999999=+Form20!$H$105","999999=+Form20!$G$106","999999=+Form20!$H$106","999999=+Form20!$G$107","999999=+Form20!$H$107","999999=+Form20!$H$108","999999=+Form20!$H$109","999999=+Form20!$H$110"]
["999999=+Form21!$C$8","999999=+Form21!$C$7","999999=+Form21!$C$25","999999=+Form21!$E$4","999999=+Form21!$C$37","999999=+Form21!$C$24","999999=+Form21!$C$26","999999=+Form21!$F$26","999999=+Form21!$C$27","999999=+Form21!$C$38","999999=+Form21!$C$39","999999=+Form21!$C$40","999999=+Form21!$C$17","999999=+Form21!$C$18","999999=+Form21!$F$18","999999=+Form21!$C$19","999999=+Form21!$C$20","999999=+Form21!$E$20","999999=+Form21!$C$64","999999=+Form21!$C$66","999999=+Form21!$C$65","999999=+Form21!$C$67","999999=+Form21!$C$68","999999=+Form21!$C$60","999999=+Form21!$C$69","999999=+Form21!$C$70","999999=+Form21!$C$71","999999=+Form21!$I$48","999999=+Form21!$I$49","999999=+Form21!$I$50","999999=+Form21!$I$55","999999=+Form21!$J$55","999999=+Form21!$I$60","999999=+Form21!$I$61","999999=+Form21!$C$78","999999=+Form21!$C$79","999999=+Form21!$C$82","999999=+Form21!$C$126","999999=+Form21!$C$125","999999=+Form21!$C$124","999999=+Form21!$C$123","999999=+Form21!$C$95","999999=+Form21!$D$95","999999=+Form21!$C$96","999999=+Form21!$D$96","999999=+Form21!$C$97","999999=+Form21!$D$97","999999=+Form21!$D$98","999999=+Form21!$D$99","999999=+Form21!$D$100","999999=+Form21!$C$105","999999=+Form21!$D$105","999999=+Form21!$C$106","999999=+Form21!$D$106","999999=+Form21!$C$107","999999=+Form21!$D$107","999999=+Form21!$D$108","999999=+Form21!$D$109","999999=+Form21!$D$110","999999=+Form21!$E$95","999999=+Form21!$F$95","999999=+Form21!$E$96","999999=+Form21!$F$96","999999=+Form21!$E$97","999999=+Form21!$F$97","999999=+Form21!$F$98","999999=+Form21!$F$99","999999=+Form21!$F$100","999999=+Form21!$G$95","999999=+Form21!$H$95","999999=+Form21!$G$96","999999=+Form21!$H$96","999999=+Form21!$G$97","999999=+Form21!$H$97","999999=+Form21!$H$98","999999=+Form21!$H$99","999999=+Form21!$H$100",null,"999999=+Form21!$E$105","999999=+Form21!$F$105","999999=+Form21!$E$106","999999=+Form21!$F$106","999999=+Form21!$E$107","999999=+Form21!$F$107","999999=+Form21!$F$108","999999=+Form21!$F$109","999999=+Form21!$F$110","999999=+Form21!$G$105","999999=+Form21!$H$105","999999=+Form21!$G$106","999999=+Form21!$H$106","999999=+Form21!$G$107","999999=+Form21!$H$107","999999=+Form21!$H$108","999999=+Form21!$H$109","999999=+Form21!$H$110"]
["999999=+Form22!$C$8","999999=+Form22!$C$7","999999=+Form22!$C$25","999999=+Form22!$E$4","999999=+Form22!$C$37","999999=+Form22!$C$24","999999=+Form22!$C$26","999999=+Form22!$F$26","999999=+Form22!$C$27","999999=+Form22!$C$38","999999=+Form22!$C$39","999999=+Form22!$C$40","999999=+Form22!$C$17","999999=+Form22!$C$18","999999=+Form22!$F$18","999999=+Form22!$C$19","999999=+Form22!$C$20","999999=+Form22!$E$20","999999=+Form22!$C$64","999999=+Form22!$C$66","999999=+Form22!$C$65","999999=+Form22!$C$67","999999=+Form22!$C$68","999999=+Form22!$C$60","999999=+Form22!$C$69","999999=+Form22!$C$70","999999=+Form22!$C$71","999999=+Form22!$I$48","999999=+Form22!$I$49","999999=+Form22!$I$50","999999=+Form22!$I$55","999999=+Form22!$J$55","999999=+Form22!$I$60","999999=+Form22!$I$61","999999=+Form22!$C$78","999999=+Form22!$C$79","999999=+Form22!$C$82","999999=+Form22!$C$126","999999=+Form22!$C$125","999999=+Form22!$C$124","999999=+Form22!$C$123","999999=+Form22!$C$95","999999=+Form22!$D$95","999999=+Form22!$C$96","999999=+Form22!$D$96","999999=+Form22!$C$97","999999=+Form22!$D$97","999999=+Form22!$D$98","999999=+Form22!$D$99","999999=+Form22!$D$100","999999=+Form22!$C$105","999999=+Form22!$D$105","999999=+Form22!$C$106","999999=+Form22!$D$106","999999=+Form22!$C$107","999999=+Form22!$D$107","999999=+Form22!$D$108","999999=+Form22!$D$109","999999=+Form22!$D$110","999999=+Form22!$E$95","999999=+Form22!$F$95","999999=+Form22!$E$96","999999=+Form22!$F$96","999999=+Form22!$E$97","999999=+Form22!$F$97","999999=+Form22!$F$98","999999=+Form22!$F$99","999999=+Form22!$F$100","999999=+Form22!$G$95","999999=+Form22!$H$95","999999=+Form22!$G$96","999999=+Form22!$H$96","999999=+Form22!$G$97","999999=+Form22!$H$97","999999=+Form22!$H$98","999999=+Form22!$H$99","999999=+Form22!$H$100",null,"999999=+Form22!$E$105","999999=+Form22!$F$105","999999=+Form22!$E$106","999999=+Form22!$F$106","999999=+Form22!$E$107","999999=+Form22!$F$107","999999=+Form22!$F$108","999999=+Form22!$F$109","999999=+Form22!$F$110","999999=+Form22!$G$105","999999=+Form22!$H$105","999999=+Form22!$G$106","999999=+Form22!$H$106","999999=+Form22!$G$107","999999=+Form22!$H$107","999999=+Form22!$H$108","999999=+Form22!$H$109","999999=+Form22!$H$110"]
["999999=+Form23!$C$8","999999=+Form23!$C$7","999999=+Form23!$C$25","999999=+Form23!$E$4","999999=+Form23!$C$37","999999=+Form23!$C$24","999999=+Form23!$C$26","999999=+Form23!$F$26","999999=+Form23!$C$27","999999=+Form23!$C$38","999999=+Form23!$C$39","999999=+Form23!$C$40","999999=+Form23!$C$17","999999=+Form23!$C$18","999999=+Form23!$F$18","999999=+Form23!$C$19","999999=+Form23!$C$20","999999=+Form23!$E$20","999999=+Form23!$C$64","999999=+Form23!$C$66","999999=+Form23!$C$65","999999=+Form23!$C$67","999999=+Form23!$C$68","999999=+Form23!$C$60","999999=+Form23!$C$69","999999=+Form23!$C$70","999999=+Form23!$C$71","999999=+Form23!$I$48","999999=+Form23!$I$49","999999=+Form23!$I$50","999999=+Form23!$I$55","999999=+Form23!$J$55","999999=+Form23!$I$60","999999=+Form23!$I$61","999999=+Form23!$C$78","999999=+Form23!$C$79","999999=+Form23!$C$82","999999=+Form23!$C$126","999999=+Form23!$C$125","999999=+Form23!$C$124","999999=+Form23!$C$123","999999=+Form23!$C$95","999999=+Form23!$D$95","999999=+Form23!$C$96","999999=+Form23!$D$96","999999=+Form23!$C$97","999999=+Form23!$D$97","999999=+Form23!$D$98","999999=+Form23!$D$99","999999=+Form23!$D$100","999999=+Form23!$C$105","999999=+Form23!$D$105","999999=+Form23!$C$106","999999=+Form23!$D$106","999999=+Form23!$C$107","999999=+Form23!$D$107","999999=+Form23!$D$108","999999=+Form23!$D$109","999999=+Form23!$D$110","999999=+Form23!$E$95","999999=+Form23!$F$95","999999=+Form23!$E$96","999999=+Form23!$F$96","999999=+Form23!$E$97","999999=+Form23!$F$97","999999=+Form23!$F$98","999999=+Form23!$F$99","999999=+Form23!$F$100","999999=+Form23!$G$95","999999=+Form23!$H$95","999999=+Form23!$G$96","999999=+Form23!$H$96","999999=+Form23!$G$97","999999=+Form23!$H$97","999999=+Form23!$H$98","999999=+Form23!$H$99","999999=+Form23!$H$100",null,"999999=+Form23!$E$105","999999=+Form23!$F$105","999999=+Form23!$E$106","999999=+Form23!$F$106","999999=+Form23!$E$107","999999=+Form23!$F$107","999999=+Form23!$F$108","999999=+Form23!$F$109","999999=+Form23!$F$110","999999=+Form23!$G$105","999999=+Form23!$H$105","999999=+Form23!$G$106","999999=+Form23!$H$106","999999=+Form23!$G$107","999999=+Form23!$H$107","999999=+Form23!$H$108","999999=+Form23!$H$109","999999=+Form23!$H$110"]
["999999=+Form24!$C$8","999999=+Form24!$C$7","999999=+Form24!$C$25","999999=+Form24!$E$4","999999=+Form24!$C$37","999999=+Form24!$C$24","999999=+Form24!$C$26","999999=+Form24!$F$26","999999=+Form24!$C$27","999999=+Form24!$C$38","999999=+Form24!$C$39","999999=+Form24!$C$40","999999=+Form24!$C$17","999999=+Form24!$C$18","999999=+Form24!$F$18","999999=+Form24!$C$19","999999=+Form24!$C$20","999999=+Form24!$E$20","999999=+Form24!$C$64","999999=+Form24!$C$66","999999=+Form24!$C$65","999999=+Form24!$C$67","999999=+Form24!$C$68","999999=+Form24!$C$60","999999=+Form24!$C$69","999999=+Form24!$C$70","999999=+Form24!$C$71","999999=+Form24!$I$48","999999=+Form24!$I$49","999999=+Form24!$I$50","999999=+Form24!$I$55","999999=+Form24!$J$55","999999=+Form24!$I$60","999999=+Form24!$I$61","999999=+Form24!$C$78","999999=+Form24!$C$79","999999=+Form24!$C$82","999999=+Form24!$C$126","999999=+Form24!$C$125","999999=+Form24!$C$124","999999=+Form24!$C$123","999999=+Form24!$C$95","999999=+Form24!$D$95","999999=+Form24!$C$96","999999=+Form24!$D$96","999999=+Form24!$C$97","999999=+Form24!$D$97","999999=+Form24!$D$98","999999=+Form24!$D$99","999999=+Form24!$D$100","999999=+Form24!$C$105","999999=+Form24!$D$105","999999=+Form24!$C$106","999999=+Form24!$D$106","999999=+Form24!$C$107","999999=+Form24!$D$107","999999=+Form24!$D$108","999999=+Form24!$D$109","999999=+Form24!$D$110","999999=+Form24!$E$95","999999=+Form24!$F$95","999999=+Form24!$E$96","999999=+Form24!$F$96","999999=+Form24!$E$97","999999=+Form24!$F$97","999999=+Form24!$F$98","999999=+Form24!$F$99","999999=+Form24!$F$100","999999=+Form24!$G$95","999999=+Form24!$H$95","999999=+Form24!$G$96","999999=+Form24!$H$96","999999=+Form24!$G$97","999999=+Form24!$H$97","999999=+Form24!$H$98","999999=+Form24!$H$99","999999=+Form24!$H$100",null,"999999=+Form24!$E$105","999999=+Form24!$F$105","999999=+Form24!$E$106","999999=+Form24!$F$106","999999=+Form24!$E$107","999999=+Form24!$F$107","999999=+Form24!$F$108","999999=+Form24!$F$109","999999=+Form24!$F$110","999999=+Form24!$G$105","999999=+Form24!$H$105","999999=+Form24!$G$106","999999=+Form24!$H$106","999999=+Form24!$G$107","999999=+Form24!$H$107","999999=+Form24!$H$108","999999=+Form24!$H$109","999999=+Form24!$H$110"]
["999999=+Form25!$C$8","999999=+Form25!$C$7","999999=+Form25!$C$25","999999=+Form25!$E$4","999999=+Form25!$C$37","999999=+Form25!$C$24","999999=+Form25!$C$26","999999=+Form25!$F$26","999999=+Form25!$C$27","999999=+Form25!$C$38","999999=+Form25!$C$39","999999=+Form25!$C$40","999999=+Form25!$C$17","999999=+Form25!$C$18","999999=+Form25!$F$18","999999=+Form25!$C$19","999999=+Form25!$C$20","999999=+Form25!$E$20","999999=+Form25!$C$64","999999=+Form25!$C$66","999999=+Form25!$C$65","999999=+Form25!$C$67","999999=+Form25!$C$68","999999=+Form25!$C$60","999999=+Form25!$C$69","999999=+Form25!$C$70","999999=+Form25!$C$71","999999=+Form25!$I$48","999999=+Form25!$I$49","999999=+Form25!$I$50","999999=+Form25!$I$55","999999=+Form25!$J$55","999999=+Form25!$I$60","999999=+Form25!$I$61","999999=+Form25!$C$78","999999=+Form25!$C$79","999999=+Form25!$C$82","999999=+Form25!$C$126","999999=+Form25!$C$125","999999=+Form25!$C$124","999999=+Form25!$C$123","999999=+Form25!$C$95","999999=+Form25!$D$95","999999=+Form25!$C$96","999999=+Form25!$D$96","999999=+Form25!$C$97","999999=+Form25!$D$97","999999=+Form25!$D$98","999999=+Form25!$D$99","999999=+Form25!$D$100","999999=+Form25!$C$105","999999=+Form25!$D$105","999999=+Form25!$C$106","999999=+Form25!$D$106","999999=+Form25!$C$107","999999=+Form25!$D$107","999999=+Form25!$D$108","999999=+Form25!$D$109","999999=+Form25!$D$110","999999=+Form25!$E$95","999999=+Form25!$F$95","999999=+Form25!$E$96","999999=+Form25!$F$96","999999=+Form25!$E$97","999999=+Form25!$F$97","999999=+Form25!$F$98","999999=+Form25!$F$99","999999=+Form25!$F$100","999999=+Form25!$G$95","999999=+Form25!$H$95","999999=+Form25!$G$96","999999=+Form25!$H$96","999999=+Form25!$G$97","999999=+Form25!$H$97","999999=+Form25!$H$98","999999=+Form25!$H$99","999999=+Form25!$H$100",null,"999999=+Form25!$E$105","999999=+Form25!$F$105","999999=+Form25!$E$106","999999=+Form25!$F$106","999999=+Form25!$E$107","999999=+Form25!$F$107","999999=+Form25!$F$108","999999=+Form25!$F$109","999999=+Form25!$F$110","999999=+Form25!$G$105","999999=+Form25!$H$105","999999=+Form25!$G$106","999999=+Form25!$H$106","999999=+Form25!$G$107","999999=+Form25!$H$107","999999=+Form25!$H$108","999999=+Form25!$H$109","999999=+Form25!$H$110"]
["999999=+Form26!$C$8","999999=+Form26!$C$7","999999=+Form26!$C$25","999999=+Form26!$E$4","999999=+Form26!$C$37","999999=+Form26!$C$24","999999=+Form26!$C$26","999999=+Form26!$F$26","999999=+Form26!$C$27","999999=+Form26!$C$38","999999=+Form26!$C$39","999999=+Form26!$C$40","999999=+Form26!$C$17","999999=+Form26!$C$18","999999=+Form26!$F$18","999999=+Form26!$C$19","999999=+Form26!$C$20","999999=+Form26!$E$20","999999=+Form26!$C$64","999999=+Form26!$C$66","999999=+Form26!$C$65","999999=+Form26!$C$67","999999=+Form26!$C$68","999999=+Form26!$C$60","999999=+Form26!$C$69","999999=+Form26!$C$70","999999=+Form26!$C$71","999999=+Form26!$I$48","999999=+Form26!$I$49","999999=+Form26!$I$50","999999=+Form26!$I$55","999999=+Form26!$J$55","999999=+Form26!$I$60","999999=+Form26!$I$61","999999=+Form26!$C$78","999999=+Form26!$C$79","999999=+Form26!$C$82","999999=+Form26!$C$126","999999=+Form26!$C$125","999999=+Form26!$C$124","999999=+Form26!$C$123","999999=+Form26!$C$95","999999=+Form26!$D$95","999999=+Form26!$C$96","999999=+Form26!$D$96","999999=+Form26!$C$97","999999=+Form26!$D$97","999999=+Form26!$D$98","999999=+Form26!$D$99","999999=+Form26!$D$100","999999=+Form26!$C$105","999999=+Form26!$D$105","999999=+Form26!$C$106","999999=+Form26!$D$106","999999=+Form26!$C$107","999999=+Form26!$D$107","999999=+Form26!$D$108","999999=+Form26!$D$109","999999=+Form26!$D$110","999999=+Form26!$E$95","999999=+Form26!$F$95","999999=+Form26!$E$96","999999=+Form26!$F$96","999999=+Form26!$E$97","999999=+Form26!$F$97","999999=+Form26!$F$98","999999=+Form26!$F$99","999999=+Form26!$F$100","999999=+Form26!$G$95","999999=+Form26!$H$95","999999=+Form26!$G$96","999999=+Form26!$H$96","999999=+Form26!$G$97","999999=+Form26!$H$97","999999=+Form26!$H$98","999999=+Form26!$H$99","999999=+Form26!$H$100",null,"999999=+Form26!$E$105","999999=+Form26!$F$105","999999=+Form26!$E$106","999999=+Form26!$F$106","999999=+Form26!$E$107","999999=+Form26!$F$107","999999=+Form26!$F$108","999999=+Form26!$F$109","999999=+Form26!$F$110","999999=+Form26!$G$105","999999=+Form26!$H$105","999999=+Form26!$G$106","999999=+Form26!$H$106","999999=+Form26!$G$107","999999=+Form26!$H$107","999999=+Form26!$H$108","999999=+Form26!$H$109","999999=+Form26!$H$110"]
["999999=+Form27!$C$8","999999=+Form27!$C$7","999999=+Form27!$C$25","999999=+Form27!$E$4","999999=+Form27!$C$37","999999=+Form27!$C$24","999999=+Form27!$C$26","999999=+Form27!$F$26","999999=+Form27!$C$27","999999=+Form27!$C$38","999999=+Form27!$C$39","999999=+Form27!$C$40","999999=+Form27!$C$17","999999=+Form27!$C$18","999999=+Form27!$F$18","999999=+Form27!$C$19","999999=+Form27!$C$20","999999=+Form27!$E$20","999999=+Form27!$C$64","999999=+Form27!$C$66","999999=+Form27!$C$65","999999=+Form27!$C$67","999999=+Form27!$C$68","999999=+Form27!$C$60","999999=+Form27!$C$69","999999=+Form27!$C$70","999999=+Form27!$C$71","999999=+Form27!$I$48","999999=+Form27!$I$49","999999=+Form27!$I$50","999999=+Form27!$I$55","999999=+Form27!$J$55","999999=+Form27!$I$60","999999=+Form27!$I$61","999999=+Form27!$C$78","999999=+Form27!$C$79","999999=+Form27!$C$82","999999=+Form27!$C$126","999999=+Form27!$C$125","999999=+Form27!$C$124","999999=+Form27!$C$123","999999=+Form27!$C$95","999999=+Form27!$D$95","999999=+Form27!$C$96","999999=+Form27!$D$96","999999=+Form27!$C$97","999999=+Form27!$D$97","999999=+Form27!$D$98","999999=+Form27!$D$99","999999=+Form27!$D$100","999999=+Form27!$C$105","999999=+Form27!$D$105","999999=+Form27!$C$106","999999=+Form27!$D$106","999999=+Form27!$C$107","999999=+Form27!$D$107","999999=+Form27!$D$108","999999=+Form27!$D$109","999999=+Form27!$D$110","999999=+Form27!$E$95","999999=+Form27!$F$95","999999=+Form27!$E$96","999999=+Form27!$F$96","999999=+Form27!$E$97","999999=+Form27!$F$97","999999=+Form27!$F$98","999999=+Form27!$F$99","999999=+Form27!$F$100","999999=+Form27!$G$95","999999=+Form27!$H$95","999999=+Form27!$G$96","999999=+Form27!$H$96","999999=+Form27!$G$97","999999=+Form27!$H$97","999999=+Form27!$H$98","999999=+Form27!$H$99","999999=+Form27!$H$100",null,"999999=+Form27!$E$105","999999=+Form27!$F$105","999999=+Form27!$E$106","999999=+Form27!$F$106","999999=+Form27!$E$107","999999=+Form27!$F$107","999999=+Form27!$F$108","999999=+Form27!$F$109","999999=+Form27!$F$110","999999=+Form27!$G$105","999999=+Form27!$H$105","999999=+Form27!$G$106","999999=+Form27!$H$106","999999=+Form27!$G$107","999999=+Form27!$H$107","999999=+Form27!$H$108","999999=+Form27!$H$109","999999=+Form27!$H$110"]
["999999=+Form28!$C$8","999999=+Form28!$C$7","999999=+Form28!$C$25","999999=+Form28!$E$4","999999=+Form28!$C$37","999999=+Form28!$C$24","999999=+Form28!$C$26","999999=+Form28!$F$26","999999=+Form28!$C$27","999999=+Form28!$C$38","999999=+Form28!$C$39","999999=+Form28!$C$40","999999=+Form28!$C$17","999999=+Form28!$C$18","999999=+Form28!$F$18","999999=+Form28!$C$19","999999=+Form28!$C$20","999999=+Form28!$E$20","999999=+Form28!$C$64","999999=+Form28!$C$66","999999=+Form28!$C$65","999999=+Form28!$C$67","999999=+Form28!$C$68","999999=+Form28!$C$60","999999=+Form28!$C$69","999999=+Form28!$C$70","999999=+Form28!$C$71","999999=+Form28!$I$48","999999=+Form28!$I$49","999999=+Form28!$I$50","999999=+Form28!$I$55","999999=+Form28!$J$55","999999=+Form28!$I$60","999999=+Form28!$I$61","999999=+Form28!$C$78","999999=+Form28!$C$79","999999=+Form28!$C$82","999999=+Form28!$C$126","999999=+Form28!$C$125","999999=+Form28!$C$124","999999=+Form28!$C$123","999999=+Form28!$C$95","999999=+Form28!$D$95","999999=+Form28!$C$96","999999=+Form28!$D$96","999999=+Form28!$C$97","999999=+Form28!$D$97","999999=+Form28!$D$98","999999=+Form28!$D$99","999999=+Form28!$D$100","999999=+Form28!$C$105","999999=+Form28!$D$105","999999=+Form28!$C$106","999999=+Form28!$D$106","999999=+Form28!$C$107","999999=+Form28!$D$107","999999=+Form28!$D$108","999999=+Form28!$D$109","999999=+Form28!$D$110","999999=+Form28!$E$95","999999=+Form28!$F$95","999999=+Form28!$E$96","999999=+Form28!$F$96","999999=+Form28!$E$97","999999=+Form28!$F$97","999999=+Form28!$F$98","999999=+Form28!$F$99","999999=+Form28!$F$100","999999=+Form28!$G$95","999999=+Form28!$H$95","999999=+Form28!$G$96","999999=+Form28!$H$96","999999=+Form28!$G$97","999999=+Form28!$H$97","999999=+Form28!$H$98","999999=+Form28!$H$99","999999=+Form28!$H$100",null,"999999=+Form28!$E$105","999999=+Form28!$F$105","999999=+Form28!$E$106","999999=+Form28!$F$106","999999=+Form28!$E$107","999999=+Form28!$F$107","999999=+Form28!$F$108","999999=+Form28!$F$109","999999=+Form28!$F$110","999999=+Form28!$G$105","999999=+Form28!$H$105","999999=+Form28!$G$106","999999=+Form28!$H$106","999999=+Form28!$G$107","999999=+Form28!$H$107","999999=+Form28!$H$108","999999=+Form28!$H$109","999999=+Form28!$H$110"]
["999999=+Form29!$C$8","999999=+Form29!$C$7","999999=+Form29!$C$25","999999=+Form29!$E$4","999999=+Form29!$C$37","999999=+Form29!$C$24","999999=+Form29!$C$26","999999=+Form29!$F$26","999999=+Form29!$C$27","999999=+Form29!$C$38","999999=+Form29!$C$39","999999=+Form29!$C$40","999999=+Form29!$C$17","999999=+Form29!$C$18","999999=+Form29!$F$18","999999=+Form29!$C$19","999999=+Form29!$C$20","999999=+Form29!$E$20","999999=+Form29!$C$64","999999=+Form29!$C$66","999999=+Form29!$C$65","999999=+Form29!$C$67","999999=+Form29!$C$68","999999=+Form29!$C$60","999999=+Form29!$C$69","999999=+Form29!$C$70","999999=+Form29!$C$71","999999=+Form29!$I$48","999999=+Form29!$I$49","999999=+Form29!$I$50","999999=+Form29!$I$55","999999=+Form29!$J$55","999999=+Form29!$I$60","999999=+Form29!$I$61","999999=+Form29!$C$78","999999=+Form29!$C$79","999999=+Form29!$C$82","999999=+Form29!$C$126","999999=+Form29!$C$125","999999=+Form29!$C$124","999999=+Form29!$C$123","999999=+Form29!$C$95","999999=+Form29!$D$95","999999=+Form29!$C$96","999999=+Form29!$D$96","999999=+Form29!$C$97","999999=+Form29!$D$97","999999=+Form29!$D$98","999999=+Form29!$D$99","999999=+Form29!$D$100","999999=+Form29!$C$105","999999=+Form29!$D$105","999999=+Form29!$C$106","999999=+Form29!$D$106","999999=+Form29!$C$107","999999=+Form29!$D$107","999999=+Form29!$D$108","999999=+Form29!$D$109","999999=+Form29!$D$110","999999=+Form29!$E$95","999999=+Form29!$F$95","999999=+Form29!$E$96","999999=+Form29!$F$96","999999=+Form29!$E$97","999999=+Form29!$F$97","999999=+Form29!$F$98","999999=+Form29!$F$99","999999=+Form29!$F$100","999999=+Form29!$G$95","999999=+Form29!$H$95","999999=+Form29!$G$96","999999=+Form29!$H$96","999999=+Form29!$G$97","999999=+Form29!$H$97","999999=+Form29!$H$98","999999=+Form29!$H$99","999999=+Form29!$H$100",null,"999999=+Form29!$E$105","999999=+Form29!$F$105","999999=+Form29!$E$106","999999=+Form29!$F$106","999999=+Form29!$E$107","999999=+Form29!$F$107","999999=+Form29!$F$108","999999=+Form29!$F$109","999999=+Form29!$F$110","999999=+Form29!$G$105","999999=+Form29!$H$105","999999=+Form29!$G$106","999999=+Form29!$H$106","999999=+Form29!$G$107","999999=+Form29!$H$107","999999=+Form29!$H$108","999999=+Form29!$H$109","999999=+Form29!$H$110"]
["999999=+Form30!$C$8","999999=+Form30!$C$7","999999=+Form30!$C$25","999999=+Form30!$E$4","999999=+Form30!$C$37","999999=+Form30!$C$24","999999=+Form30!$C$26","999999=+Form30!$F$26","999999=+Form30!$C$27","999999=+Form30!$C$38","999999=+Form30!$C$39","999999=+Form30!$C$40","999999=+Form30!$C$17","999999=+Form30!$C$18","999999=+Form30!$F$18","999999=+Form30!$C$19","999999=+Form30!$C$20","999999=+Form30!$E$20","999999=+Form30!$C$64","999999=+Form30!$C$66","999999=+Form30!$C$65","999999=+Form30!$C$67","999999=+Form30!$C$68","999999=+Form30!$C$60","999999=+Form30!$C$69","999999=+Form30!$C$70","999999=+Form30!$C$71","999999=+Form30!$I$48","999999=+Form30!$I$49","999999=+Form30!$I$50","999999=+Form30!$I$55","999999=+Form30!$J$55","999999=+Form30!$I$60","999999=+Form30!$I$61","999999=+Form30!$C$78","999999=+Form30!$C$79","999999=+Form30!$C$82","999999=+Form30!$C$126","999999=+Form30!$C$125","999999=+Form30!$C$124","999999=+Form30!$C$123","999999=+Form30!$C$95","999999=+Form30!$D$95","999999=+Form30!$C$96","999999=+Form30!$D$96","999999=+Form30!$C$97","999999=+Form30!$D$97","999999=+Form30!$D$98","999999=+Form30!$D$99","999999=+Form30!$D$100","999999=+Form30!$C$105","999999=+Form30!$D$105","999999=+Form30!$C$106","999999=+Form30!$D$106","999999=+Form30!$C$107","999999=+Form30!$D$107","999999=+Form30!$D$108","999999=+Form30!$D$109","999999=+Form30!$D$110","999999=+Form30!$E$95","999999=+Form30!$F$95","999999=+Form30!$E$96","999999=+Form30!$F$96","999999=+Form30!$E$97","999999=+Form30!$F$97","999999=+Form30!$F$98","999999=+Form30!$F$99","999999=+Form30!$F$100","999999=+Form30!$G$95","999999=+Form30!$H$95","999999=+Form30!$G$96","999999=+Form30!$H$96","999999=+Form30!$G$97","999999=+Form30!$H$97","999999=+Form30!$H$98","999999=+Form30!$H$99","999999=+Form30!$H$100",null,"999999=+Form30!$E$105","999999=+Form30!$F$105","999999=+Form30!$E$106","999999=+Form30!$F$106","999999=+Form30!$E$107","999999=+Form30!$F$107","999999=+Form30!$F$108","999999=+Form30!$F$109","999999=+Form30!$F$110","999999=+Form30!$G$105","999999=+Form30!$H$105","999999=+Form30!$G$106","999999=+Form30!$H$106","999999=+Form30!$G$107","999999=+Form30!$H$107","999999=+Form30!$H$108","999999=+Form30!$H$109","999999=+Form30!$H$110"]
["999999=+Form31!$C$8","999999=+Form31!$C$7","999999=+Form31!$C$25","999999=+Form31!$E$4","999999=+Form31!$C$37","999999=+Form31!$C$24","999999=+Form31!$C$26","999999=+Form31!$F$26","999999=+Form31!$C$27","999999=+Form31!$C$38","999999=+Form31!$C$39","999999=+Form31!$C$40","999999=+Form31!$C$17","999999=+Form31!$C$18","999999=+Form31!$F$18","999999=+Form31!$C$19","999999=+Form31!$C$20","999999=+Form31!$E$20","999999=+Form31!$C$64","999999=+Form31!$C$66","999999=+Form31!$C$65","999999=+Form31!$C$67","999999=+Form31!$C$68","999999=+Form31!$C$60","999999=+Form31!$C$69","999999=+Form31!$C$70","999999=+Form31!$C$71","999999=+Form31!$I$48","999999=+Form31!$I$49","999999=+Form31!$I$50","999999=+Form31!$I$55","999999=+Form31!$J$55","999999=+Form31!$I$60","999999=+Form31!$I$61","999999=+Form31!$C$78","999999=+Form31!$C$79","999999=+Form31!$C$82","999999=+Form31!$C$126","999999=+Form31!$C$125","999999=+Form31!$C$124","999999=+Form31!$C$123","999999=+Form31!$C$95","999999=+Form31!$D$95","999999=+Form31!$C$96","999999=+Form31!$D$96","999999=+Form31!$C$97","999999=+Form31!$D$97","999999=+Form31!$D$98","999999=+Form31!$D$99","999999=+Form31!$D$100","999999=+Form31!$C$105","999999=+Form31!$D$105","999999=+Form31!$C$106","999999=+Form31!$D$106","999999=+Form31!$C$107","999999=+Form31!$D$107","999999=+Form31!$D$108","999999=+Form31!$D$109","999999=+Form31!$D$110","999999=+Form31!$E$95","999999=+Form31!$F$95","999999=+Form31!$E$96","999999=+Form31!$F$96","999999=+Form31!$E$97","999999=+Form31!$F$97","999999=+Form31!$F$98","999999=+Form31!$F$99","999999=+Form31!$F$100","999999=+Form31!$G$95","999999=+Form31!$H$95","999999=+Form31!$G$96","999999=+Form31!$H$96","999999=+Form31!$G$97","999999=+Form31!$H$97","999999=+Form31!$H$98","999999=+Form31!$H$99","999999=+Form31!$H$100",null,"999999=+Form31!$E$105","999999=+Form31!$F$105","999999=+Form31!$E$106","999999=+Form31!$F$106","999999=+Form31!$E$107","999999=+Form31!$F$107","999999=+Form31!$F$108","999999=+Form31!$F$109","999999=+Form31!$F$110","999999=+Form31!$G$105","999999=+Form31!$H$105","999999=+Form31!$G$106","999999=+Form31!$H$106","999999=+Form31!$G$107","999999=+Form31!$H$107","999999=+Form31!$H$108","999999=+Form31!$H$109","999999=+Form31!$H$110"]
["999999=+Form32!$C$8","999999=+Form32!$C$7","999999=+Form32!$C$25","999999=+Form32!$E$4","999999=+Form32!$C$37","999999=+Form32!$C$24","999999=+Form32!$C$26","999999=+Form32!$F$26","999999=+Form32!$C$27","999999=+Form32!$C$38","999999=+Form32!$C$39","999999=+Form32!$C$40","999999=+Form32!$C$17","999999=+Form32!$C$18","999999=+Form32!$F$18","999999=+Form32!$C$19","999999=+Form32!$C$20","999999=+Form32!$E$20","999999=+Form32!$C$64","999999=+Form32!$C$66","999999=+Form32!$C$65","999999=+Form32!$C$67","999999=+Form32!$C$68","999999=+Form32!$C$60","999999=+Form32!$C$69","999999=+Form32!$C$70","999999=+Form32!$C$71","999999=+Form32!$I$48","999999=+Form32!$I$49","999999=+Form32!$I$50","999999=+Form32!$I$55","999999=+Form32!$J$55","999999=+Form32!$I$60","999999=+Form32!$I$61","999999=+Form32!$C$78","999999=+Form32!$C$79","999999=+Form32!$C$82","999999=+Form32!$C$126","999999=+Form32!$C$125","999999=+Form32!$C$124","999999=+Form32!$C$123","999999=+Form32!$C$95","999999=+Form32!$D$95","999999=+Form32!$C$96","999999=+Form32!$D$96","999999=+Form32!$C$97","999999=+Form32!$D$97","999999=+Form32!$D$98","999999=+Form32!$D$99","999999=+Form32!$D$100","999999=+Form32!$C$105","999999=+Form32!$D$105","999999=+Form32!$C$106","999999=+Form32!$D$106","999999=+Form32!$C$107","999999=+Form32!$D$107","999999=+Form32!$D$108","999999=+Form32!$D$109","999999=+Form32!$D$110","999999=+Form32!$E$95","999999=+Form32!$F$95","999999=+Form32!$E$96","999999=+Form32!$F$96","999999=+Form32!$E$97","999999=+Form32!$F$97","999999=+Form32!$F$98","999999=+Form32!$F$99","999999=+Form32!$F$100","999999=+Form32!$G$95","999999=+Form32!$H$95","999999=+Form32!$G$96","999999=+Form32!$H$96","999999=+Form32!$G$97","999999=+Form32!$H$97","999999=+Form32!$H$98","999999=+Form32!$H$99","999999=+Form32!$H$100",null,"999999=+Form32!$E$105","999999=+Form32!$F$105","999999=+Form32!$E$106","999999=+Form32!$F$106","999999=+Form32!$E$107","999999=+Form32!$F$107","999999=+Form32!$F$108","999999=+Form32!$F$109","999999=+Form32!$F$110","999999=+Form32!$G$105","999999=+Form32!$H$105","999999=+Form32!$G$106","999999=+Form32!$H$106","999999=+Form32!$G$107","999999=+Form32!$H$107","999999=+Form32!$H$108","999999=+Form32!$H$109","999999=+Form32!$H$110"]
["999999=+Form33!$C$8","999999=+Form33!$C$7","999999=+Form33!$C$25","999999=+Form33!$E$4","999999=+Form33!$C$37","999999=+Form33!$C$24","999999=+Form33!$C$26","999999=+Form33!$F$26","999999=+Form33!$C$27","999999=+Form33!$C$38","999999=+Form33!$C$39","999999=+Form33!$C$40","999999=+Form33!$C$17","999999=+Form33!$C$18","999999=+Form33!$F$18","999999=+Form33!$C$19","999999=+Form33!$C$20","999999=+Form33!$E$20","999999=+Form33!$C$64","999999=+Form33!$C$66","999999=+Form33!$C$65","999999=+Form33!$C$67","999999=+Form33!$C$68","999999=+Form33!$C$60","999999=+Form33!$C$69","999999=+Form33!$C$70","999999=+Form33!$C$71","999999=+Form33!$I$48","999999=+Form33!$I$49","999999=+Form33!$I$50","999999=+Form33!$I$55","999999=+Form33!$J$55","999999=+Form33!$I$60","999999=+Form33!$I$61","999999=+Form33!$C$78","999999=+Form33!$C$79","999999=+Form33!$C$82","999999=+Form33!$C$126","999999=+Form33!$C$125","999999=+Form33!$C$124","999999=+Form33!$C$123","999999=+Form33!$C$95","999999=+Form33!$D$95","999999=+Form33!$C$96","999999=+Form33!$D$96","999999=+Form33!$C$97","999999=+Form33!$D$97","999999=+Form33!$D$98","999999=+Form33!$D$99","999999=+Form33!$D$100","999999=+Form33!$C$105","999999=+Form33!$D$105","999999=+Form33!$C$106","999999=+Form33!$D$106","999999=+Form33!$C$107","999999=+Form33!$D$107","999999=+Form33!$D$108","999999=+Form33!$D$109","999999=+Form33!$D$110","999999=+Form33!$E$95","999999=+Form33!$F$95","999999=+Form33!$E$96","999999=+Form33!$F$96","999999=+Form33!$E$97","999999=+Form33!$F$97","999999=+Form33!$F$98","999999=+Form33!$F$99","999999=+Form33!$F$100","999999=+Form33!$G$95","999999=+Form33!$H$95","999999=+Form33!$G$96","999999=+Form33!$H$96","999999=+Form33!$G$97","999999=+Form33!$H$97","999999=+Form33!$H$98","999999=+Form33!$H$99","999999=+Form33!$H$100",null,"999999=+Form33!$E$105","999999=+Form33!$F$105","999999=+Form33!$E$106","999999=+Form33!$F$106","999999=+Form33!$E$107","999999=+Form33!$F$107","999999=+Form33!$F$108","999999=+Form33!$F$109","999999=+Form33!$F$110","999999=+Form33!$G$105","999999=+Form33!$H$105","999999=+Form33!$G$106","999999=+Form33!$H$106","999999=+Form33!$G$107","999999=+Form33!$H$107","999999=+Form33!$H$108","999999=+Form33!$H$109","999999=+Form33!$H$110"]
["999999=+Form34!$C$8","999999=+Form34!$C$7","999999=+Form34!$C$25","999999=+Form34!$E$4","999999=+Form34!$C$37","999999=+Form34!$C$24","999999=+Form34!$C$26","999999=+Form34!$F$26","999999=+Form34!$C$27","999999=+Form34!$C$38","999999=+Form34!$C$39","999999=+Form34!$C$40","999999=+Form34!$C$17","999999=+Form34!$C$18","999999=+Form34!$F$18","999999=+Form34!$C$19","999999=+Form34!$C$20","999999=+Form34!$E$20","999999=+Form34!$C$64","999999=+Form34!$C$66","999999=+Form34!$C$65","999999=+Form34!$C$67","999999=+Form34!$C$68","999999=+Form34!$C$60","999999=+Form34!$C$69","999999=+Form34!$C$70","999999=+Form34!$C$71","999999=+Form34!$I$48","999999=+Form34!$I$49","999999=+Form34!$I$50","999999=+Form34!$I$55","999999=+Form34!$J$55","999999=+Form34!$I$60","999999=+Form34!$I$61","999999=+Form34!$C$78","999999=+Form34!$C$79","999999=+Form34!$C$82","999999=+Form34!$C$126","999999=+Form34!$C$125","999999=+Form34!$C$124","999999=+Form34!$C$123","999999=+Form34!$C$95","999999=+Form34!$D$95","999999=+Form34!$C$96","999999=+Form34!$D$96","999999=+Form34!$C$97","999999=+Form34!$D$97","999999=+Form34!$D$98","999999=+Form34!$D$99","999999=+Form34!$D$100","999999=+Form34!$C$105","999999=+Form34!$D$105","999999=+Form34!$C$106","999999=+Form34!$D$106","999999=+Form34!$C$107","999999=+Form34!$D$107","999999=+Form34!$D$108","999999=+Form34!$D$109","999999=+Form34!$D$110","999999=+Form34!$E$95","999999=+Form34!$F$95","999999=+Form34!$E$96","999999=+Form34!$F$96","999999=+Form34!$E$97","999999=+Form34!$F$97","999999=+Form34!$F$98","999999=+Form34!$F$99","999999=+Form34!$F$100","999999=+Form34!$G$95","999999=+Form34!$H$95","999999=+Form34!$G$96","999999=+Form34!$H$96","999999=+Form34!$G$97","999999=+Form34!$H$97","999999=+Form34!$H$98","999999=+Form34!$H$99","999999=+Form34!$H$100",null,"999999=+Form34!$E$105","999999=+Form34!$F$105","999999=+Form34!$E$106","999999=+Form34!$F$106","999999=+Form34!$E$107","999999=+Form34!$F$107","999999=+Form34!$F$108","999999=+Form34!$F$109","999999=+Form34!$F$110","999999=+Form34!$G$105","999999=+Form34!$H$105","999999=+Form34!$G$106","999999=+Form34!$H$106","999999=+Form34!$G$107","999999=+Form34!$H$107","999999=+Form34!$H$108","999999=+Form34!$H$109","999999=+Form34!$H$110"]
["999999=+Form35!$C$8","999999=+Form35!$C$7","999999=+Form35!$C$25","999999=+Form35!$E$4","999999=+Form35!$C$37","999999=+Form35!$C$24","999999=+Form35!$C$26","999999=+Form35!$F$26","999999=+Form35!$C$27","999999=+Form35!$C$38","999999=+Form35!$C$39","999999=+Form35!$C$40","999999=+Form35!$C$17","999999=+Form35!$C$18","999999=+Form35!$F$18","999999=+Form35!$C$19","999999=+Form35!$C$20","999999=+Form35!$E$20","999999=+Form35!$C$64","999999=+Form35!$C$66","999999=+Form35!$C$65","999999=+Form35!$C$67","999999=+Form35!$C$68","999999=+Form35!$C$60","999999=+Form35!$C$69","999999=+Form35!$C$70","999999=+Form35!$C$71","999999=+Form35!$I$48","999999=+Form35!$I$49","999999=+Form35!$I$50","999999=+Form35!$I$55","999999=+Form35!$J$55","999999=+Form35!$I$60","999999=+Form35!$I$61","999999=+Form35!$C$78","999999=+Form35!$C$79","999999=+Form35!$C$82","999999=+Form35!$C$126","999999=+Form35!$C$125","999999=+Form35!$C$124","999999=+Form35!$C$123","999999=+Form35!$C$95","999999=+Form35!$D$95","999999=+Form35!$C$96","999999=+Form35!$D$96","999999=+Form35!$C$97","999999=+Form35!$D$97","999999=+Form35!$D$98","999999=+Form35!$D$99","999999=+Form35!$D$100","999999=+Form35!$C$105","999999=+Form35!$D$105","999999=+Form35!$C$106","999999=+Form35!$D$106","999999=+Form35!$C$107","999999=+Form35!$D$107","999999=+Form35!$D$108","999999=+Form35!$D$109","999999=+Form35!$D$110","999999=+Form35!$E$95","999999=+Form35!$F$95","999999=+Form35!$E$96","999999=+Form35!$F$96","999999=+Form35!$E$97","999999=+Form35!$F$97","999999=+Form35!$F$98","999999=+Form35!$F$99","999999=+Form35!$F$100","999999=+Form35!$G$95","999999=+Form35!$H$95","999999=+Form35!$G$96","999999=+Form35!$H$96","999999=+Form35!$G$97","999999=+Form35!$H$97","999999=+Form35!$H$98","999999=+Form35!$H$99","999999=+Form35!$H$100",null,"999999=+Form35!$E$105","999999=+Form35!$F$105","999999=+Form35!$E$106","999999=+Form35!$F$106","999999=+Form35!$E$107","999999=+Form35!$F$107","999999=+Form35!$F$108","999999=+Form35!$F$109","999999=+Form35!$F$110","999999=+Form35!$G$105","999999=+Form35!$H$105","999999=+Form35!$G$106","999999=+Form35!$H$106","999999=+Form35!$G$107","999999=+Form35!$H$107","999999=+Form35!$H$108","999999=+Form35!$H$109","999999=+Form35!$H$110"]
["999999=+Form36!$C$8","999999=+Form36!$C$7","999999=+Form36!$C$25","999999=+Form36!$E$4","999999=+Form36!$C$37","999999=+Form36!$C$24","999999=+Form36!$C$26","999999=+Form36!$F$26","999999=+Form36!$C$27","999999=+Form36!$C$38","999999=+Form36!$C$39","999999=+Form36!$C$40","999999=+Form36!$C$17","999999=+Form36!$C$18","999999=+Form36!$F$18","999999=+Form36!$C$19","999999=+Form36!$C$20","999999=+Form36!$E$20","999999=+Form36!$C$64","999999=+Form36!$C$66","999999=+Form36!$C$65","999999=+Form36!$C$67","999999=+Form36!$C$68","999999=+Form36!$C$60","999999=+Form36!$C$69","999999=+Form36!$C$70","999999=+Form36!$C$71","999999=+Form36!$I$48","999999=+Form36!$I$49","999999=+Form36!$I$50","999999=+Form36!$I$55","999999=+Form36!$J$55","999999=+Form36!$I$60","999999=+Form36!$I$61","999999=+Form36!$C$78","999999=+Form36!$C$79","999999=+Form36!$C$82","999999=+Form36!$C$126","999999=+Form36!$C$125","999999=+Form36!$C$124","999999=+Form36!$C$123","999999=+Form36!$C$95","999999=+Form36!$D$95","999999=+Form36!$C$96","999999=+Form36!$D$96","999999=+Form36!$C$97","999999=+Form36!$D$97","999999=+Form36!$D$98","999999=+Form36!$D$99","999999=+Form36!$D$100","999999=+Form36!$C$105","999999=+Form36!$D$105","999999=+Form36!$C$106","999999=+Form36!$D$106","999999=+Form36!$C$107","999999=+Form36!$D$107","999999=+Form36!$D$108","999999=+Form36!$D$109","999999=+Form36!$D$110","999999=+Form36!$E$95","999999=+Form36!$F$95","999999=+Form36!$E$96","999999=+Form36!$F$96","999999=+Form36!$E$97","999999=+Form36!$F$97","999999=+Form36!$F$98","999999=+Form36!$F$99","999999=+Form36!$F$100","999999=+Form36!$G$95","999999=+Form36!$H$95","999999=+Form36!$G$96","999999=+Form36!$H$96","999999=+Form36!$G$97","999999=+Form36!$H$97","999999=+Form36!$H$98","999999=+Form36!$H$99","999999=+Form36!$H$100",null,"999999=+Form36!$E$105","999999=+Form36!$F$105","999999=+Form36!$E$106","999999=+Form36!$F$106","999999=+Form36!$E$107","999999=+Form36!$F$107","999999=+Form36!$F$108","999999=+Form36!$F$109","999999=+Form36!$F$110","999999=+Form36!$G$105","999999=+Form36!$H$105","999999=+Form36!$G$106","999999=+Form36!$H$106","999999=+Form36!$G$107","999999=+Form36!$H$107","999999=+Form36!$H$108","999999=+Form36!$H$109","999999=+Form36!$H$110"]
["999999=+Form37!$C$8","999999=+Form37!$C$7","999999=+Form37!$C$25","999999=+Form37!$E$4","999999=+Form37!$C$37","999999=+Form51!$C$24","999999=+Form37!$C$26","999999=+Form37!$F$26","999999=+Form37!$C$27","999999=+Form37!$C$38","999999=+Form37!$C$39","999999=+Form37!$C$40","999999=+Form37!$C$17","999999=+Form37!$C$18","999999=+Form37!$F$18","999999=+Form37!$C$19","999999=+Form37!$C$20","999999=+Form37!$E$20","999999=+Form37!$C$64","999999=+Form37!$C$66","999999=+Form37!$C$65","999999=+Form37!$C$67","999999=+Form37!$C$68","999999=+Form37!$C$60","999999=+Form37!$C$69","999999=+Form37!$C$70","999999=+Form37!$C$71","999999=+Form37!$I$48","999999=+Form37!$I$49","999999=+Form37!$I$50","999999=+Form37!$I$55","999999=+Form37!$J$55","999999=+Form37!$I$60","999999=+Form37!$I$61","999999=+Form37!$C$78","999999=+Form37!$C$79","999999=+Form37!$C$82","999999=+Form37!$C$126","999999=+Form37!$C$125","999999=+Form37!$C$124","999999=+Form37!$C$123","999999=+Form37!$C$95","999999=+Form37!$D$95","999999=+Form37!$C$96","999999=+Form37!$D$96","999999=+Form37!$C$97","999999=+Form37!$D$97","999999=+Form37!$D$98","999999=+Form37!$D$99","999999=+Form37!$D$100","999999=+Form37!$C$105","999999=+Form37!$D$105","999999=+Form37!$C$106","999999=+Form37!$D$106","999999=+Form37!$C$107","999999=+Form37!$D$107","999999=+Form37!$D$108","999999=+Form37!$D$109","999999=+Form37!$D$110","999999=+Form37!$E$95","999999=+Form37!$F$95","999999=+Form37!$E$96","999999=+Form37!$F$96","999999=+Form37!$E$97","999999=+Form37!$F$97","999999=+Form37!$F$98","999999=+Form37!$F$99","999999=+Form37!$F$100","999999=+Form37!$G$95","999999=+Form37!$H$95","999999=+Form37!$G$96","999999=+Form37!$H$96","999999=+Form37!$G$97","999999=+Form37!$H$97","999999=+Form37!$H$98","999999=+Form37!$H$99","999999=+Form37!$H$100",null,"999999=+Form37!$E$105","999999=+Form37!$F$105","999999=+Form37!$E$106","999999=+Form37!$F$106","999999=+Form37!$E$107","999999=+Form37!$F$107","999999=+Form37!$F$108","999999=+Form37!$F$109","999999=+Form37!$F$110","999999=+Form37!$G$105","999999=+Form37!$H$105","999999=+Form37!$G$106","999999=+Form37!$H$106","999999=+Form37!$G$107","999999=+Form37!$H$107","999999=+Form37!$H$108","999999=+Form37!$H$109","999999=+Form37!$H$110"]
["999999=+Form38!$C$8","999999=+Form38!$C$7","999999=+Form38!$C$25","999999=+Form38!$E$4","999999=+Form38!$C$37","999999=+Form38!$C$24","999999=+Form38!$C$26","999999=+Form38!$F$26","999999=+Form38!$C$27","999999=+Form38!$C$38","999999=+Form38!$C$39","999999=+Form38!$C$40","999999=+Form38!$C$17","999999=+Form38!$C$18","999999=+Form38!$F$18","999999=+Form38!$C$19","999999=+Form38!$C$20","999999=+Form38!$E$20","999999=+Form38!$C$64","999999=+Form38!$C$66","999999=+Form38!$C$65","999999=+Form38!$C$67","999999=+Form38!$C$68","999999=+Form38!$C$60","999999=+Form38!$C$69","999999=+Form38!$C$70","999999=+Form38!$C$71","999999=+Form38!$I$48","999999=+Form38!$I$49","999999=+Form38!$I$50","999999=+Form38!$I$55","999999=+Form38!$J$55","999999=+Form38!$I$60","999999=+Form38!$I$61","999999=+Form38!$C$78","999999=+Form38!$C$79","999999=+Form38!$C$82","999999=+Form38!$C$126","999999=+Form38!$C$125","999999=+Form38!$C$124","999999=+Form38!$C$123","999999=+Form38!$C$95","999999=+Form38!$D$95","999999=+Form38!$C$96","999999=+Form38!$D$96","999999=+Form38!$C$97","999999=+Form38!$D$97","999999=+Form38!$D$98","999999=+Form38!$D$99","999999=+Form38!$D$100","999999=+Form38!$C$105","999999=+Form38!$D$105","999999=+Form38!$C$106","999999=+Form38!$D$106","999999=+Form38!$C$107","999999=+Form38!$D$107","999999=+Form38!$D$108","999999=+Form38!$D$109","999999=+Form38!$D$110","999999=+Form38!$E$95","999999=+Form38!$F$95","999999=+Form38!$E$96","999999=+Form38!$F$96","999999=+Form38!$E$97","999999=+Form38!$F$97","999999=+Form38!$F$98","999999=+Form38!$F$99","999999=+Form38!$F$100","999999=+Form38!$G$95","999999=+Form38!$H$95","999999=+Form38!$G$96","999999=+Form38!$H$96","999999=+Form38!$G$97","999999=+Form38!$H$97","999999=+Form38!$H$98","999999=+Form38!$H$99","999999=+Form38!$H$100",null,"999999=+Form38!$E$105","999999=+Form38!$F$105","999999=+Form38!$E$106","999999=+Form38!$F$106","999999=+Form38!$E$107","999999=+Form38!$F$107","999999=+Form38!$F$108","999999=+Form38!$F$109","999999=+Form38!$F$110","999999=+Form38!$G$105","999999=+Form38!$H$105","999999=+Form38!$G$106","999999=+Form38!$H$106","999999=+Form38!$G$107","999999=+Form38!$H$107","999999=+Form38!$H$108","999999=+Form38!$H$109","999999=+Form38!$H$110"]
["999999=+Form39!$C$8","999999=+Form39!$C$7","999999=+Form39!$C$25","999999=+Form39!$E$4","999999=+Form39!$C$37","999999=+Form39!$C$24","999999=+Form39!$C$26","999999=+Form39!$F$26","999999=+Form39!$C$27","999999=+Form39!$C$38","999999=+Form39!$C$39","999999=+Form39!$C$40","999999=+Form39!$C$17","999999=+Form39!$C$18","999999=+Form39!$F$18","999999=+Form39!$C$19","999999=+Form39!$C$20","999999=+Form39!$E$20","999999=+Form39!$C$64","999999=+Form39!$C$66","999999=+Form39!$C$65","999999=+Form39!$C$67","999999=+Form39!$C$68","999999=+Form39!$C$60","999999=+Form39!$C$69","999999=+Form39!$C$70","999999=+Form39!$C$71","999999=+Form39!$I$48","999999=+Form39!$I$49","999999=+Form39!$I$50","999999=+Form39!$I$55","999999=+Form39!$J$55","999999=+Form39!$I$60","999999=+Form39!$I$61","999999=+Form39!$C$78","999999=+Form39!$C$79","999999=+Form39!$C$82","999999=+Form39!$C$126","999999=+Form39!$C$125","999999=+Form39!$C$124","999999=+Form39!$C$123","999999=+Form39!$C$95","999999=+Form39!$D$95","999999=+Form39!$C$96","999999=+Form39!$D$96","999999=+Form39!$C$97","999999=+Form39!$D$97","999999=+Form39!$D$98","999999=+Form39!$D$99","999999=+Form39!$D$100","999999=+Form39!$C$105","999999=+Form39!$D$105","999999=+Form39!$C$106","999999=+Form39!$D$106","999999=+Form39!$C$107","999999=+Form39!$D$107","999999=+Form39!$D$108","999999=+Form39!$D$109","999999=+Form39!$D$110","999999=+Form39!$E$95","999999=+Form39!$F$95","999999=+Form39!$E$96","999999=+Form39!$F$96","999999=+Form39!$E$97","999999=+Form39!$F$97","999999=+Form39!$F$98","999999=+Form39!$F$99","999999=+Form39!$F$100","999999=+Form39!$G$95","999999=+Form39!$H$95","999999=+Form39!$G$96","999999=+Form39!$H$96","999999=+Form39!$G$97","999999=+Form39!$H$97","999999=+Form39!$H$98","999999=+Form39!$H$99","999999=+Form39!$H$100",null,"999999=+Form39!$E$105","999999=+Form39!$F$105","999999=+Form39!$E$106","999999=+Form39!$F$106","999999=+Form39!$E$107","999999=+Form39!$F$107","999999=+Form39!$F$108","999999=+Form39!$F$109","999999=+Form39!$F$110","999999=+Form39!$G$105","999999=+Form39!$H$105","999999=+Form39!$G$106","999999=+Form39!$H$106","999999=+Form39!$G$107","999999=+Form39!$H$107","999999=+Form39!$H$108","999999=+Form39!$H$109","999999=+Form39!$H$110"]
["999999=+Form40!$C$8","999999=+Form40!$C$7","999999=+Form40!$C$25","999999=+Form40!$E$4","999999=+Form40!$C$37","999999=+Form40!$C$24","999999=+Form40!$C$26","999999=+Form40!$F$26","999999=+Form40!$C$27","999999=+Form40!$C$38","999999=+Form40!$C$39","999999=+Form40!$C$40","999999=+Form40!$C$17","999999=+Form40!$C$18","999999=+Form40!$F$18","999999=+Form40!$C$19","999999=+Form40!$C$20","999999=+Form40!$E$20","999999=+Form40!$C$64","999999=+Form40!$C$66","999999=+Form40!$C$65","999999=+Form40!$C$67","999999=+Form40!$C$68","999999=+Form40!$C$60","999999=+Form40!$C$69","999999=+Form40!$C$70","999999=+Form40!$C$71","999999=+Form40!$I$48","999999=+Form40!$I$49","999999=+Form40!$I$50","999999=+Form40!$I$55","999999=+Form40!$J$55","999999=+Form40!$I$60","999999=+Form40!$I$61","999999=+Form40!$C$78","999999=+Form40!$C$79","999999=+Form40!$C$82","999999=+Form40!$C$126","999999=+Form40!$C$125","999999=+Form40!$C$124","999999=+Form40!$C$123","999999=+Form40!$C$95","999999=+Form40!$D$95","999999=+Form40!$C$96","999999=+Form40!$D$96","999999=+Form40!$C$97","999999=+Form40!$D$97","999999=+Form40!$D$98","999999=+Form40!$D$99","999999=+Form40!$D$100","999999=+Form40!$C$105","999999=+Form40!$D$105","999999=+Form40!$C$106","999999=+Form40!$D$106","999999=+Form40!$C$107","999999=+Form40!$D$107","999999=+Form40!$D$108","999999=+Form40!$D$109","999999=+Form40!$D$110","999999=+Form40!$E$95","999999=+Form40!$F$95","999999=+Form40!$E$96","999999=+Form40!$F$96","999999=+Form40!$E$97","999999=+Form40!$F$97","999999=+Form40!$F$98","999999=+Form40!$F$99","999999=+Form40!$F$100","999999=+Form40!$G$95","999999=+Form40!$H$95","999999=+Form40!$G$96","999999=+Form40!$H$96","999999=+Form40!$G$97","999999=+Form40!$H$97","999999=+Form40!$H$98","999999=+Form40!$H$99","999999=+Form40!$H$100",null,"999999=+Form40!$E$105","999999=+Form40!$F$105","999999=+Form40!$E$106","999999=+Form40!$F$106","999999=+Form40!$E$107","999999=+Form40!$F$107","999999=+Form40!$F$108","999999=+Form40!$F$109","999999=+Form40!$F$110","999999=+Form40!$G$105","999999=+Form40!$H$105","999999=+Form40!$G$106","999999=+Form40!$H$106","999999=+Form40!$G$107","999999=+Form40!$H$107","999999=+Form40!$H$108","999999=+Form40!$H$109","999999=+Form40!$H$110"]
["999999=+Form41!$C$8","999999=+Form41!$C$7","999999=+Form41!$C$25","999999=+Form41!$E$4","999999=+Form41!$C$37","999999=+Form41!$C$24","999999=+Form41!$C$26","999999=+Form41!$F$26","999999=+Form41!$C$27","999999=+Form41!$C$38","999999=+Form41!$C$39","999999=+Form41!$C$40","999999=+Form41!$C$17","999999=+Form41!$C$18","999999=+Form41!$F$18","999999=+Form41!$C$19","999999=+Form41!$C$20","999999=+Form41!$E$20","999999=+Form41!$C$64","999999=+Form41!$C$66","999999=+Form41!$C$65","999999=+Form41!$C$67","999999=+Form41!$C$68","999999=+Form41!$C$60","999999=+Form41!$C$69","999999=+Form41!$C$70","999999=+Form41!$C$71","999999=+Form41!$I$48","999999=+Form41!$I$49","999999=+Form41!$I$50","999999=+Form41!$I$55","999999=+Form41!$J$55","999999=+Form41!$I$60","999999=+Form41!$I$61","999999=+Form41!$C$78","999999=+Form41!$C$79","999999=+Form41!$C$82","999999=+Form41!$C$126","999999=+Form41!$C$125","999999=+Form41!$C$124","999999=+Form41!$C$123","999999=+Form41!$C$95","999999=+Form41!$D$95","999999=+Form41!$C$96","999999=+Form41!$D$96","999999=+Form41!$C$97","999999=+Form41!$D$97","999999=+Form41!$D$98","999999=+Form41!$D$99","999999=+Form41!$D$100","999999=+Form41!$C$105","999999=+Form41!$D$105","999999=+Form41!$C$106","999999=+Form41!$D$106","999999=+Form41!$C$107","999999=+Form41!$D$107","999999=+Form41!$D$108","999999=+Form41!$D$109","999999=+Form41!$D$110","999999=+Form41!$E$95","999999=+Form41!$F$95","999999=+Form41!$E$96","999999=+Form41!$F$96","999999=+Form41!$E$97","999999=+Form41!$F$97","999999=+Form41!$F$98","999999=+Form41!$F$99","999999=+Form41!$F$100","999999=+Form41!$G$95","999999=+Form41!$H$95","999999=+Form41!$G$96","999999=+Form41!$H$96","999999=+Form41!$G$97","999999=+Form41!$H$97","999999=+Form41!$H$98","999999=+Form41!$H$99","999999=+Form41!$H$100",null,"999999=+Form41!$E$105","999999=+Form41!$F$105","999999=+Form41!$E$106","999999=+Form41!$F$106","999999=+Form41!$E$107","999999=+Form41!$F$107","999999=+Form41!$F$108","999999=+Form41!$F$109","999999=+Form41!$F$110","999999=+Form41!$G$105","999999=+Form41!$H$105","999999=+Form41!$G$106","999999=+Form41!$H$106","999999=+Form41!$G$107","999999=+Form41!$H$107","999999=+Form41!$H$108","999999=+Form41!$H$109","999999=+Form41!$H$110"]
["999999=+Form42!$C$8","999999=+Form42!$C$7","999999=+Form42!$C$25","999999=+Form42!$E$4","999999=+Form42!$C$37","999999=+Form42!$C$24","999999=+Form42!$C$26","999999=+Form42!$F$26","999999=+Form42!$C$27","999999=+Form42!$C$38","999999=+Form42!$C$39","999999=+Form42!$C$40","999999=+Form42!$C$17","999999=+Form42!$C$18","999999=+Form42!$F$18","999999=+Form42!$C$19","999999=+Form42!$C$20","999999=+Form42!$E$20","999999=+Form42!$C$64","999999=+Form42!$C$66","999999=+Form42!$C$65","999999=+Form42!$C$67","999999=+Form42!$C$68","999999=+Form42!$C$60","999999=+Form42!$C$69","999999=+Form42!$C$70","999999=+Form42!$C$71","999999=+Form42!$I$48","999999=+Form42!$I$49","999999=+Form42!$I$50","999999=+Form42!$I$55","999999=+Form42!$J$55","999999=+Form42!$I$60","999999=+Form42!$I$61","999999=+Form42!$C$78","999999=+Form42!$C$79","999999=+Form42!$C$82","999999=+Form42!$C$126","999999=+Form42!$C$125","999999=+Form42!$C$124","999999=+Form42!$C$123","999999=+Form42!$C$95","999999=+Form42!$D$95","999999=+Form42!$C$96","999999=+Form42!$D$96","999999=+Form42!$C$97","999999=+Form42!$D$97","999999=+Form42!$D$98","999999=+Form42!$D$99","999999=+Form42!$D$100","999999=+Form42!$C$105","999999=+Form42!$D$105","999999=+Form42!$C$106","999999=+Form42!$D$106","999999=+Form42!$C$107","999999=+Form42!$D$107","999999=+Form42!$D$108","999999=+Form42!$D$109","999999=+Form42!$D$110","999999=+Form42!$E$95","999999=+Form42!$F$95","999999=+Form42!$E$96","999999=+Form42!$F$96","999999=+Form42!$E$97","999999=+Form42!$F$97","999999=+Form42!$F$98","999999=+Form42!$F$99","999999=+Form42!$F$100","999999=+Form42!$G$95","999999=+Form42!$H$95","999999=+Form42!$G$96","999999=+Form42!$H$96","999999=+Form42!$G$97","999999=+Form42!$H$97","999999=+Form42!$H$98","999999=+Form42!$H$99","999999=+Form42!$H$100",null,"999999=+Form42!$E$105","999999=+Form42!$F$105","999999=+Form42!$E$106","999999=+Form42!$F$106","999999=+Form42!$E$107","999999=+Form42!$F$107","999999=+Form42!$F$108","999999=+Form42!$F$109","999999=+Form42!$F$110","999999=+Form42!$G$105","999999=+Form42!$H$105","999999=+Form42!$G$106","999999=+Form42!$H$106","999999=+Form42!$G$107","999999=+Form42!$H$107","999999=+Form42!$H$108","999999=+Form42!$H$109","999999=+Form42!$H$110"]
["999999=+Form43!$C$8","999999=+Form43!$C$7","999999=+Form43!$C$25","999999=+Form43!$E$4","999999=+Form43!$C$37","999999=+Form43!$C$24","999999=+Form43!$C$26","999999=+Form43!$F$26","999999=+Form43!$C$27","999999=+Form43!$C$38","999999=+Form43!$C$39","999999=+Form43!$C$40","999999=+Form43!$C$17","999999=+Form43!$C$18","999999=+Form43!$F$18","999999=+Form43!$C$19","999999=+Form43!$C$20","999999=+Form43!$E$20","999999=+Form43!$C$64","999999=+Form43!$C$66","999999=+Form43!$C$65","999999=+Form43!$C$67","999999=+Form43!$C$68","999999=+Form43!$C$60","999999=+Form43!$C$69","999999=+Form43!$C$70","999999=+Form43!$C$71","999999=+Form43!$I$48","999999=+Form43!$I$49","999999=+Form43!$I$50","999999=+Form43!$I$55","999999=+Form43!$J$55","999999=+Form43!$I$60","999999=+Form43!$I$61","999999=+Form43!$C$78","999999=+Form43!$C$79","999999=+Form43!$C$82","999999=+Form43!$C$126","999999=+Form43!$C$125","999999=+Form43!$C$124","999999=+Form43!$C$123","999999=+Form43!$C$95","999999=+Form43!$D$95","999999=+Form43!$C$96","999999=+Form43!$D$96","999999=+Form43!$C$97","999999=+Form43!$D$97","999999=+Form43!$D$98","999999=+Form43!$D$99","999999=+Form43!$D$100","999999=+Form43!$C$105","999999=+Form43!$D$105","999999=+Form43!$C$106","999999=+Form43!$D$106","999999=+Form43!$C$107","999999=+Form43!$D$107","999999=+Form43!$D$108","999999=+Form43!$D$109","999999=+Form43!$D$110","999999=+Form43!$E$95","999999=+Form43!$F$95","999999=+Form43!$E$96","999999=+Form43!$F$96","999999=+Form43!$E$97","999999=+Form43!$F$97","999999=+Form43!$F$98","999999=+Form43!$F$99","999999=+Form43!$F$100","999999=+Form43!$G$95","999999=+Form43!$H$95","999999=+Form43!$G$96","999999=+Form43!$H$96","999999=+Form43!$G$97","999999=+Form43!$H$97","999999=+Form43!$H$98","999999=+Form43!$H$99","999999=+Form43!$H$100",null,"999999=+Form43!$E$105","999999=+Form43!$F$105","999999=+Form43!$E$106","999999=+Form43!$F$106","999999=+Form43!$E$107","999999=+Form43!$F$107","999999=+Form43!$F$108","999999=+Form43!$F$109","999999=+Form43!$F$110","999999=+Form43!$G$105","999999=+Form43!$H$105","999999=+Form43!$G$106","999999=+Form43!$H$106","999999=+Form43!$G$107","999999=+Form43!$H$107","999999=+Form43!$H$108","999999=+Form43!$H$109","999999=+Form43!$H$110"]
["999999=+Form44!$C$8","999999=+Form44!$C$7","999999=+Form44!$C$25","999999=+Form44!$E$4","999999=+Form44!$C$37","999999=+Form44!$C$24","999999=+Form44!$C$26","999999=+Form44!$F$26","999999=+Form44!$C$27","999999=+Form44!$C$38","999999=+Form44!$C$39","999999=+Form44!$C$40","999999=+Form44!$C$17","999999=+Form44!$C$18","999999=+Form44!$F$18","999999=+Form44!$C$19","999999=+Form44!$C$20","999999=+Form44!$E$20","999999=+Form44!$C$64","999999=+Form44!$C$66","999999=+Form44!$C$65","999999=+Form44!$C$67","999999=+Form44!$C$68","999999=+Form44!$C$60","999999=+Form44!$C$69","999999=+Form44!$C$70","999999=+Form44!$C$71","999999=+Form44!$I$48","999999=+Form44!$I$49","999999=+Form44!$I$50","999999=+Form44!$I$55","999999=+Form44!$J$55","999999=+Form44!$I$60","999999=+Form44!$I$61","999999=+Form44!$C$78","999999=+Form44!$C$79","999999=+Form44!$C$82","999999=+Form44!$C$126","999999=+Form44!$C$125","999999=+Form44!$C$124","999999=+Form44!$C$123","999999=+Form44!$C$95","999999=+Form44!$D$95","999999=+Form44!$C$96","999999=+Form44!$D$96","999999=+Form44!$C$97","999999=+Form44!$D$97","999999=+Form44!$D$98","999999=+Form44!$D$99","999999=+Form44!$D$100","999999=+Form44!$C$105","999999=+Form44!$D$105","999999=+Form44!$C$106","999999=+Form44!$D$106","999999=+Form44!$C$107","999999=+Form44!$D$107","999999=+Form44!$D$108","999999=+Form44!$D$109","999999=+Form44!$D$110","999999=+Form44!$E$95","999999=+Form44!$F$95","999999=+Form44!$E$96","999999=+Form44!$F$96","999999=+Form44!$E$97","999999=+Form44!$F$97","999999=+Form44!$F$98","999999=+Form44!$F$99","999999=+Form44!$F$100","999999=+Form44!$G$95","999999=+Form44!$H$95","999999=+Form44!$G$96","999999=+Form44!$H$96","999999=+Form44!$G$97","999999=+Form44!$H$97","999999=+Form44!$H$98","999999=+Form44!$H$99","999999=+Form44!$H$100",null,"999999=+Form44!$E$105","999999=+Form44!$F$105","999999=+Form44!$E$106","999999=+Form44!$F$106","999999=+Form44!$E$107","999999=+Form44!$F$107","999999=+Form44!$F$108","999999=+Form44!$F$109","999999=+Form44!$F$110","999999=+Form44!$G$105","999999=+Form44!$H$105","999999=+Form44!$G$106","999999=+Form44!$H$106","999999=+Form44!$G$107","999999=+Form44!$H$107","999999=+Form44!$H$108","999999=+Form44!$H$109","999999=+Form44!$H$110"]
["999999=+Form45!$C$8","999999=+Form45!$C$7","999999=+Form45!$C$25","999999=+Form45!$E$4","999999=+Form45!$C$37","999999=+Form45!$C$24","999999=+Form45!$C$26","999999=+Form45!$F$26","999999=+Form45!$C$27","999999=+Form45!$C$38","999999=+Form45!$C$39","999999=+Form45!$C$40","999999=+Form45!$C$17","999999=+Form45!$C$18","999999=+Form45!$F$18","999999=+Form45!$C$19","999999=+Form45!$C$20","999999=+Form45!$E$20","999999=+Form45!$C$64","999999=+Form45!$C$66","999999=+Form45!$C$65","999999=+Form45!$C$67","999999=+Form45!$C$68","999999=+Form45!$C$60","999999=+Form45!$C$69","999999=+Form45!$C$70","999999=+Form45!$C$71","999999=+Form45!$I$48","999999=+Form45!$I$49","999999=+Form45!$I$50","999999=+Form45!$I$55","999999=+Form45!$J$55","999999=+Form45!$I$60","999999=+Form45!$I$61","999999=+Form45!$C$78","999999=+Form45!$C$79","999999=+Form45!$C$82","999999=+Form45!$C$126","999999=+Form45!$C$125","999999=+Form45!$C$124","999999=+Form45!$C$123","999999=+Form45!$C$95","999999=+Form45!$D$95","999999=+Form45!$C$96","999999=+Form45!$D$96","999999=+Form45!$C$97","999999=+Form45!$D$97","999999=+Form45!$D$98","999999=+Form45!$D$99","999999=+Form45!$D$100","999999=+Form45!$C$105","999999=+Form45!$D$105","999999=+Form45!$C$106","999999=+Form45!$D$106","999999=+Form45!$C$107","999999=+Form45!$D$107","999999=+Form45!$D$108","999999=+Form45!$D$109","999999=+Form45!$D$110","999999=+Form45!$E$95","999999=+Form45!$F$95","999999=+Form45!$E$96","999999=+Form45!$F$96","999999=+Form45!$E$97","999999=+Form45!$F$97","999999=+Form45!$F$98","999999=+Form45!$F$99","999999=+Form45!$F$100","999999=+Form45!$G$95","999999=+Form45!$H$95","999999=+Form45!$G$96","999999=+Form45!$H$96","999999=+Form45!$G$97","999999=+Form45!$H$97","999999=+Form45!$H$98","999999=+Form45!$H$99","999999=+Form45!$H$100",null,"999999=+Form45!$E$105","999999=+Form45!$F$105","999999=+Form45!$E$106","999999=+Form45!$F$106","999999=+Form45!$E$107","999999=+Form45!$F$107","999999=+Form45!$F$108","999999=+Form45!$F$109","999999=+Form45!$F$110","999999=+Form45!$G$105","999999=+Form45!$H$105","999999=+Form45!$G$106","999999=+Form45!$H$106","999999=+Form45!$G$107","999999=+Form45!$H$107","999999=+Form45!$H$108","999999=+Form45!$H$109","999999=+Form45!$H$110"]
["999999=+Form46!$C$8","999999=+Form46!$C$7","999999=+Form46!$C$25","999999=+Form46!$E$4","999999=+Form46!$C$37","999999=+Form46!$C$24","999999=+Form46!$C$26","999999=+Form46!$F$26","999999=+Form46!$C$27","999999=+Form46!$C$38","999999=+Form46!$C$39","999999=+Form46!$C$40","999999=+Form46!$C$17","999999=+Form46!$C$18","999999=+Form46!$F$18","999999=+Form46!$C$19","999999=+Form46!$C$20","999999=+Form46!$E$20","999999=+Form46!$C$64","999999=+Form46!$C$66","999999=+Form46!$C$65","999999=+Form46!$C$67","999999=+Form46!$C$68","999999=+Form46!$C$60","999999=+Form46!$C$69","999999=+Form46!$C$70","999999=+Form46!$C$71","999999=+Form46!$I$48","999999=+Form46!$I$49","999999=+Form46!$I$50","999999=+Form46!$I$55","999999=+Form46!$J$55","999999=+Form46!$I$60","999999=+Form46!$I$61","999999=+Form46!$C$78","999999=+Form46!$C$79","999999=+Form46!$C$82","999999=+Form46!$C$126","999999=+Form46!$C$125","999999=+Form46!$C$124","999999=+Form46!$C$123","999999=+Form46!$C$95","999999=+Form46!$D$95","999999=+Form46!$C$96","999999=+Form46!$D$96","999999=+Form46!$C$97","999999=+Form46!$D$97","999999=+Form46!$D$98","999999=+Form46!$D$99","999999=+Form46!$D$100","999999=+Form46!$C$105","999999=+Form46!$D$105","999999=+Form46!$C$106","999999=+Form46!$D$106","999999=+Form46!$C$107","999999=+Form46!$D$107","999999=+Form46!$D$108","999999=+Form46!$D$109","999999=+Form46!$D$110","999999=+Form46!$E$95","999999=+Form46!$F$95","999999=+Form46!$E$96","999999=+Form46!$F$96","999999=+Form46!$E$97","999999=+Form46!$F$97","999999=+Form46!$F$98","999999=+Form46!$F$99","999999=+Form46!$F$100","999999=+Form46!$G$95","999999=+Form46!$H$95","999999=+Form46!$G$96","999999=+Form46!$H$96","999999=+Form46!$G$97","999999=+Form46!$H$97","999999=+Form46!$H$98","999999=+Form46!$H$99","999999=+Form46!$H$100",null,"999999=+Form46!$E$105","999999=+Form46!$F$105","999999=+Form46!$E$106","999999=+Form46!$F$106","999999=+Form46!$E$107","999999=+Form46!$F$107","999999=+Form46!$F$108","999999=+Form46!$F$109","999999=+Form46!$F$110","999999=+Form46!$G$105","999999=+Form46!$H$105","999999=+Form46!$G$106","999999=+Form46!$H$106","999999=+Form46!$G$107","999999=+Form46!$H$107","999999=+Form46!$H$108","999999=+Form46!$H$109","999999=+Form46!$H$110"]
["999999=+Form47!$C$8","999999=+Form47!$C$7","999999=+Form47!$C$25","999999=+Form47!$E$4","999999=+Form47!$C$37","999999=+Form47!$C$24","999999=+Form47!$C$26","999999=+Form47!$F$26","999999=+Form47!$C$27","999999=+Form47!$C$38","999999=+Form47!$C$39","999999=+Form47!$C$40","999999=+Form47!$C$17","999999=+Form47!$C$18","999999=+Form47!$F$18","999999=+Form47!$C$19","999999=+Form47!$C$20","999999=+Form47!$E$20","999999=+Form47!$C$64","999999=+Form47!$C$66","999999=+Form47!$C$65","999999=+Form47!$C$67","999999=+Form47!$C$68","999999=+Form47!$C$60","999999=+Form47!$C$69","999999=+Form47!$C$70","999999=+Form47!$C$71","999999=+Form47!$I$48","999999=+Form47!$I$49","999999=+Form47!$I$50","999999=+Form47!$I$55","999999=+Form47!$J$55","999999=+Form47!$I$60","999999=+Form47!$I$61","999999=+Form47!$C$78","999999=+Form47!$C$79","999999=+Form47!$C$82","999999=+Form47!$C$126","999999=+Form47!$C$125","999999=+Form47!$C$124","999999=+Form47!$C$123","999999=+Form47!$C$95","999999=+Form47!$D$95","999999=+Form47!$C$96","999999=+Form47!$D$96","999999=+Form47!$C$97","999999=+Form47!$D$97","999999=+Form47!$D$98","999999=+Form47!$D$99","999999=+Form47!$D$100","999999=+Form47!$C$105","999999=+Form47!$D$105","999999=+Form47!$C$106","999999=+Form47!$D$106","999999=+Form47!$C$107","999999=+Form47!$D$107","999999=+Form47!$D$108","999999=+Form47!$D$109","999999=+Form47!$D$110","999999=+Form47!$E$95","999999=+Form47!$F$95","999999=+Form47!$E$96","999999=+Form47!$F$96","999999=+Form47!$E$97","999999=+Form47!$F$97","999999=+Form47!$F$98","999999=+Form47!$F$99","999999=+Form47!$F$100","999999=+Form47!$G$95","999999=+Form47!$H$95","999999=+Form47!$G$96","999999=+Form47!$H$96","999999=+Form47!$G$97","999999=+Form47!$H$97","999999=+Form47!$H$98","999999=+Form47!$H$99","999999=+Form47!$H$100",null,"999999=+Form47!$E$105","999999=+Form47!$F$105","999999=+Form47!$E$106","999999=+Form47!$F$106","999999=+Form47!$E$107","999999=+Form47!$F$107","999999=+Form47!$F$108","999999=+Form47!$F$109","999999=+Form47!$F$110","999999=+Form47!$G$105","999999=+Form47!$H$105","999999=+Form47!$G$106","999999=+Form47!$H$106","999999=+Form47!$G$107","999999=+Form47!$H$107","999999=+Form47!$H$108","999999=+Form47!$H$109","999999=+Form47!$H$110"]
["999999=+Form48!$C$8","999999=+Form48!$C$7","999999=+Form48!$C$25","999999=+Form48!$E$4","999999=+Form48!$C$37","999999=+Form48!$C$24","999999=+Form48!$C$26","999999=+Form48!$F$26","999999=+Form48!$C$27","999999=+Form48!$C$38","999999=+Form48!$C$39","999999=+Form48!$C$40","999999=+Form48!$C$17","999999=+Form48!$C$18","999999=+Form48!$F$18","999999=+Form48!$C$19","999999=+Form48!$C$20","999999=+Form48!$E$20","999999=+Form48!$C$64","999999=+Form48!$C$66","999999=+Form48!$C$65","999999=+Form48!$C$67","999999=+Form48!$C$68","999999=+Form48!$C$60","999999=+Form48!$C$69","999999=+Form48!$C$70","999999=+Form48!$C$71","999999=+Form48!$I$48","999999=+Form48!$I$49","999999=+Form48!$I$50","999999=+Form48!$I$55","999999=+Form48!$J$55","999999=+Form48!$I$60","999999=+Form48!$I$61","999999=+Form48!$C$78","999999=+Form48!$C$79","999999=+Form48!$C$82","999999=+Form48!$C$126","999999=+Form48!$C$125","999999=+Form48!$C$124","999999=+Form48!$C$123","999999=+Form48!$C$95","999999=+Form48!$D$95","999999=+Form48!$C$96","999999=+Form48!$D$96","999999=+Form48!$C$97","999999=+Form48!$D$97","999999=+Form48!$D$98","999999=+Form48!$D$99","999999=+Form48!$D$100","999999=+Form48!$C$105","999999=+Form48!$D$105","999999=+Form48!$C$106","999999=+Form48!$D$106","999999=+Form48!$C$107","999999=+Form48!$D$107","999999=+Form48!$D$108","999999=+Form48!$D$109","999999=+Form48!$D$110","999999=+Form48!$E$95","999999=+Form48!$F$95","999999=+Form48!$E$96","999999=+Form48!$F$96","999999=+Form48!$E$97","999999=+Form48!$F$97","999999=+Form48!$F$98","999999=+Form48!$F$99","999999=+Form48!$F$100","999999=+Form48!$G$95","999999=+Form48!$H$95","999999=+Form48!$G$96","999999=+Form48!$H$96","999999=+Form48!$G$97","999999=+Form48!$H$97","999999=+Form48!$H$98","999999=+Form48!$H$99","999999=+Form48!$H$100",null,"999999=+Form48!$E$105","999999=+Form48!$F$105","999999=+Form48!$E$106","999999=+Form48!$F$106","999999=+Form48!$E$107","999999=+Form48!$F$107","999999=+Form48!$F$108","999999=+Form48!$F$109","999999=+Form48!$F$110","999999=+Form48!$G$105","999999=+Form48!$H$105","999999=+Form48!$G$106","999999=+Form48!$H$106","999999=+Form48!$G$107","999999=+Form48!$H$107","999999=+Form48!$H$108","999999=+Form48!$H$109","999999=+Form48!$H$110"]
["999999=+Form49!$C$8","999999=+Form49!$C$7","999999=+Form49!$C$25","999999=+Form49!$E$4","999999=+Form49!$C$37","999999=+Form49!$C$24","999999=+Form49!$C$26","999999=+Form49!$F$26","999999=+Form49!$C$27","999999=+Form49!$C$38","999999=+Form49!$C$39","999999=+Form49!$C$40","999999=+Form49!$C$17","999999=+Form49!$C$18","999999=+Form49!$F$18","999999=+Form49!$C$19","999999=+Form49!$C$20","999999=+Form49!$E$20","999999=+Form49!$C$64","999999=+Form49!$C$66","999999=+Form49!$C$65","999999=+Form49!$C$67","999999=+Form49!$C$68","999999=+Form49!$C$60","999999=+Form49!$C$69","999999=+Form49!$C$70","999999=+Form49!$C$71","999999=+Form49!$I$48","999999=+Form49!$I$49","999999=+Form49!$I$50","999999=+Form49!$I$55","999999=+Form49!$J$55","999999=+Form49!$I$60","999999=+Form49!$I$61","999999=+Form49!$C$78","999999=+Form49!$C$79","999999=+Form49!$C$82","999999=+Form49!$C$126","999999=+Form49!$C$125","999999=+Form49!$C$124","999999=+Form49!$C$123","999999=+Form49!$C$95","999999=+Form49!$D$95","999999=+Form49!$C$96","999999=+Form49!$D$96","999999=+Form49!$C$97","999999=+Form49!$D$97","999999=+Form49!$D$98","999999=+Form49!$D$99","999999=+Form49!$D$100","999999=+Form49!$C$105","999999=+Form49!$D$105","999999=+Form49!$C$106","999999=+Form49!$D$106","999999=+Form49!$C$107","999999=+Form49!$D$107","999999=+Form49!$D$108","999999=+Form49!$D$109","999999=+Form49!$D$110","999999=+Form49!$E$95","999999=+Form49!$F$95","999999=+Form49!$E$96","999999=+Form49!$F$96","999999=+Form49!$E$97","999999=+Form49!$F$97","999999=+Form49!$F$98","999999=+Form49!$F$99","999999=+Form49!$F$100","999999=+Form49!$G$95","999999=+Form49!$H$95","999999=+Form49!$G$96","999999=+Form49!$H$96","999999=+Form49!$G$97","999999=+Form49!$H$97","999999=+Form49!$H$98","999999=+Form49!$H$99","999999=+Form49!$H$100",null,"999999=+Form49!$E$105","999999=+Form49!$F$105","999999=+Form49!$E$106","999999=+Form49!$F$106","999999=+Form49!$E$107","999999=+Form49!$F$107","999999=+Form49!$F$108","999999=+Form49!$F$109","999999=+Form49!$F$110","999999=+Form49!$G$105","999999=+Form49!$H$105","999999=+Form49!$G$106","999999=+Form49!$H$106","999999=+Form49!$G$107","999999=+Form49!$H$107","999999=+Form49!$H$108","999999=+Form49!$H$109","999999=+Form49!$H$110"]
["999999=+Form50!$C$8","999999=+Form50!$C$7","999999=+Form50!$C$25","999999=+Form50!$E$4","999999=+Form50!$C$37","999999=+Form50!$C$24","999999=+Form50!$C$26","999999=+Form50!$F$26","999999=+Form50!$C$27","999999=+Form50!$C$38","999999=+Form50!$C$39","999999=+Form50!$C$40","999999=+Form50!$C$17","999999=+Form50!$C$18","999999=+Form50!$F$18","999999=+Form50!$C$19","999999=+Form50!$C$20","999999=+Form50!$E$20","999999=+Form50!$C$64","999999=+Form50!$C$66","999999=+Form50!$C$65","999999=+Form50!$C$67","999999=+Form50!$C$68","999999=+Form50!$C$60","999999=+Form50!$C$69","999999=+Form50!$C$70","999999=+Form50!$C$71","999999=+Form50!$I$48","999999=+Form50!$I$49","999999=+Form50!$I$50","999999=+Form50!$I$55","999999=+Form50!$J$55","999999=+Form50!$I$60","999999=+Form50!$I$61","999999=+Form50!$C$78","999999=+Form50!$C$79","999999=+Form50!$C$82","999999=+Form50!$C$126","999999=+Form50!$C$125","999999=+Form50!$C$124","999999=+Form50!$C$123","999999=+Form50!$C$95","999999=+Form50!$D$95","999999=+Form50!$C$96","999999=+Form50!$D$96","999999=+Form50!$C$97","999999=+Form50!$D$97","999999=+Form50!$D$98","999999=+Form50!$D$99","999999=+Form50!$D$100","999999=+Form50!$C$105","999999=+Form50!$D$105","999999=+Form50!$C$106","999999=+Form50!$D$106","999999=+Form50!$C$107","999999=+Form50!$D$107","999999=+Form50!$D$108","999999=+Form50!$D$109","999999=+Form50!$D$110","999999=+Form50!$E$95","999999=+Form50!$F$95","999999=+Form50!$E$96","999999=+Form50!$F$96","999999=+Form50!$E$97","999999=+Form50!$F$97","999999=+Form50!$F$98","999999=+Form50!$F$99","999999=+Form50!$F$100","999999=+Form50!$G$95","999999=+Form50!$H$95","999999=+Form50!$G$96","999999=+Form50!$H$96","999999=+Form50!$G$97","999999=+Form50!$H$97","999999=+Form50!$H$98","999999=+Form50!$H$99","999999=+Form50!$H$100",null,"999999=+Form50!$E$105","999999=+Form50!$F$105","999999=+Form50!$E$106","999999=+Form50!$F$106","999999=+Form50!$E$107","999999=+Form50!$F$107","999999=+Form50!$F$108","999999=+Form50!$F$109","999999=+Form50!$F$110","999999=+Form50!$G$105","999999=+Form50!$H$105","999999=+Form50!$G$106","999999=+Form50!$H$106","999999=+Form50!$G$107","999999=+Form50!$H$107","999999=+Form50!$H$108","999999=+Form50!$H$109","999999=+Form50!$H$110"]
["999999=+Form51!$C$8","999999=+Form51!$C$7","999999=+Form51!$C$25","999999=+Form51!$E$4","999999=+Form51!$C$37","999999=+Form51!$C$24","999999=+Form51!$C$26","999999=+Form51!$F$26","999999=+Form51!$C$27","999999=+Form51!$C$38","999999=+Form51!$C$39","999999=+Form51!$C$40","999999=+Form51!$C$17","999999=+Form51!$C$18","999999=+Form51!$F$18","999999=+Form51!$C$19","999999=+Form51!$C$20","999999=+Form51!$E$20","999999=+Form51!$C$64","999999=+Form51!$C$66","999999=+Form51!$C$65","999999=+Form51!$C$67","999999=+Form51!$C$68","999999=+Form51!$C$60","999999=+Form51!$C$69","999999=+Form51!$C$70","999999=+Form51!$C$71","999999=+Form51!$I$48","999999=+Form51!$I$49","999999=+Form51!$I$50","999999=+Form51!$I$55","999999=+Form51!$J$55","999999=+Form51!$I$60","999999=+Form51!$I$61","999999=+Form51!$C$78","999999=+Form51!$C$79","999999=+Form51!$C$82","999999=+Form51!$C$126","999999=+Form51!$C$125","999999=+Form51!$C$124","999999=+Form51!$C$123","999999=+Form51!$C$95","999999=+Form51!$D$95","999999=+Form51!$C$96","999999=+Form51!$D$96","999999=+Form51!$C$97","999999=+Form51!$D$97","999999=+Form51!$D$98","999999=+Form51!$D$99","999999=+Form51!$D$100","999999=+Form51!$C$105","999999=+Form51!$D$105","999999=+Form51!$C$106","999999=+Form51!$D$106","999999=+Form51!$C$107","999999=+Form51!$D$107","999999=+Form51!$D$108","999999=+Form51!$D$109","999999=+Form51!$D$110","999999=+Form51!$E$95","999999=+Form51!$F$95","999999=+Form51!$E$96","999999=+Form51!$F$96","999999=+Form51!$E$97","999999=+Form51!$F$97","999999=+Form51!$F$98","999999=+Form51!$F$99","999999=+Form51!$F$100","999999=+Form51!$G$95","999999=+Form51!$H$95","999999=+Form51!$G$96","999999=+Form51!$H$96","999999=+Form51!$G$97","999999=+Form51!$H$97","999999=+Form51!$H$98","999999=+Form51!$H$99","999999=+Form51!$H$100",null,"999999=+Form51!$E$105","999999=+Form51!$F$105","999999=+Form51!$E$106","999999=+Form51!$F$106","999999=+Form51!$E$107","999999=+Form51!$F$107","999999=+Form51!$F$108","999999=+Form51!$F$109","999999=+Form51!$F$110","999999=+Form51!$G$105","999999=+Form51!$H$105","999999=+Form51!$G$106","999999=+Form51!$H$106","999999=+Form51!$G$107","999999=+Form51!$H$107","999999=+Form51!$H$108","999999=+Form51!$H$109","999999=+Form51!$H$110"]
["999999=+Form52!$C$8","999999=+Form52!$C$7","999999=+Form52!$C$25","999999=+Form52!$E$4","999999=+Form52!$C$37","999999=+Form52!$C$24","999999=+Form52!$C$26","999999=+Form52!$F$26","999999=+Form52!$C$27","999999=+Form52!$C$38","999999=+Form52!$C$39","999999=+Form52!$C$40","999999=+Form52!$C$17","999999=+Form52!$C$18","999999=+Form52!$F$18","999999=+Form52!$C$19","999999=+Form52!$C$20","999999=+Form52!$E$20","999999=+Form52!$C$64","999999=+Form52!$C$66","999999=+Form52!$C$65","999999=+Form52!$C$67","999999=+Form52!$C$68","999999=+Form52!$C$60","999999=+Form52!$C$69","999999=+Form52!$C$70","999999=+Form52!$C$71","999999=+Form52!$I$48","999999=+Form52!$I$49","999999=+Form52!$I$50","999999=+Form52!$I$55","999999=+Form52!$J$55","999999=+Form52!$I$60","999999=+Form52!$I$61","999999=+Form52!$C$78","999999=+Form52!$C$79","999999=+Form52!$C$82","999999=+Form52!$C$126","999999=+Form52!$C$125","999999=+Form52!$C$124","999999=+Form52!$C$123","999999=+Form52!$C$95","999999=+Form52!$D$95","999999=+Form52!$C$96","999999=+Form52!$D$96","999999=+Form52!$C$97","999999=+Form52!$D$97","999999=+Form52!$D$98","999999=+Form52!$D$99","999999=+Form52!$D$100","999999=+Form52!$C$105","999999=+Form52!$D$105","999999=+Form52!$C$106","999999=+Form52!$D$106","999999=+Form52!$C$107","999999=+Form52!$D$107","999999=+Form52!$D$108","999999=+Form52!$D$109","999999=+Form52!$D$110","999999=+Form52!$E$95","999999=+Form52!$F$95","999999=+Form52!$E$96","999999=+Form52!$F$96","999999=+Form52!$E$97","999999=+Form52!$F$97","999999=+Form52!$F$98","999999=+Form52!$F$99","999999=+Form52!$F$100","999999=+Form52!$G$95","999999=+Form52!$H$95","999999=+Form52!$G$96","999999=+Form52!$H$96","999999=+Form52!$G$97","999999=+Form52!$H$97","999999=+Form52!$H$98","999999=+Form52!$H$99","999999=+Form52!$H$100",null,"999999=+Form52!$E$105","999999=+Form52!$F$105","999999=+Form52!$E$106","999999=+Form52!$F$106","999999=+Form52!$E$107","999999=+Form52!$F$107","999999=+Form52!$F$108","999999=+Form52!$F$109","999999=+Form52!$F$110","999999=+Form52!$G$105","999999=+Form52!$H$105","999999=+Form52!$G$106","999999=+Form52!$H$106","999999=+Form52!$G$107","999999=+Form52!$H$107","999999=+Form52!$H$108","999999=+Form52!$H$109","999999=+Form52!$H$110"]
["999999=+Form53!$C$8","999999=+Form53!$C$7","999999=+Form53!$C$25","999999=+Form53!$E$4","999999=+Form53!$C$37","999999=+Form53!$C$24","999999=+Form53!$C$26","999999=+Form53!$F$26","999999=+Form53!$C$27","999999=+Form53!$C$38","999999=+Form53!$C$39","999999=+Form53!$C$40","999999=+Form53!$C$17","999999=+Form53!$C$18","999999=+Form53!$F$18","999999=+Form53!$C$19","999999=+Form53!$C$20","999999=+Form53!$E$20","999999=+Form53!$C$64","999999=+Form53!$C$66","999999=+Form53!$C$65","999999=+Form53!$C$67","999999=+Form53!$C$68","999999=+Form53!$C$60","999999=+Form53!$C$69","999999=+Form53!$C$70","999999=+Form53!$C$71","999999=+Form53!$I$48","999999=+Form53!$I$49","999999=+Form53!$I$50","999999=+Form53!$I$55","999999=+Form53!$J$55","999999=+Form53!$I$60","999999=+Form53!$I$61","999999=+Form53!$C$78","999999=+Form53!$C$79","999999=+Form53!$C$82","999999=+Form53!$C$126","999999=+Form53!$C$125","999999=+Form53!$C$124","999999=+Form53!$C$123","999999=+Form53!$C$95","999999=+Form53!$D$95","999999=+Form53!$C$96","999999=+Form53!$D$96","999999=+Form53!$C$97","999999=+Form53!$D$97","999999=+Form53!$D$98","999999=+Form53!$D$99","999999=+Form53!$D$100","999999=+Form53!$C$105","999999=+Form53!$D$105","999999=+Form53!$C$106","999999=+Form53!$D$106","999999=+Form53!$C$107","999999=+Form53!$D$107","999999=+Form53!$D$108","999999=+Form53!$D$109","999999=+Form53!$D$110","999999=+Form53!$E$95","999999=+Form53!$F$95","999999=+Form53!$E$96","999999=+Form53!$F$96","999999=+Form53!$E$97","999999=+Form53!$F$97","999999=+Form53!$F$98","999999=+Form53!$F$99","999999=+Form53!$F$100","999999=+Form53!$G$95","999999=+Form53!$H$95","999999=+Form53!$G$96","999999=+Form53!$H$96","999999=+Form53!$G$97","999999=+Form53!$H$97","999999=+Form53!$H$98","999999=+Form53!$H$99","999999=+Form53!$H$100",null,"999999=+Form53!$E$105","999999=+Form53!$F$105","999999=+Form53!$E$106","999999=+Form53!$F$106","999999=+Form53!$E$107","999999=+Form53!$F$107","999999=+Form53!$F$108","999999=+Form53!$F$109","999999=+Form53!$F$110","999999=+Form53!$G$105","999999=+Form53!$H$105","999999=+Form53!$G$106","999999=+Form53!$H$106","999999=+Form53!$G$107","999999=+Form53!$H$107","999999=+Form53!$H$108","999999=+Form53!$H$109","999999=+Form53!$H$110"]
["999999=+Form54!$C$8","999999=+Form54!$C$7","999999=+Form54!$C$25","999999=+Form54!$E$4","999999=+Form54!$C$37","999999=+Form54!$C$24","999999=+Form54!$C$26","999999=+Form54!$F$26","999999=+Form54!$C$27","999999=+Form54!$C$38","999999=+Form54!$C$39","999999=+Form54!$C$40","999999=+Form54!$C$17","999999=+Form54!$C$18","999999=+Form54!$F$18","999999=+Form54!$C$19","999999=+Form54!$C$20","999999=+Form54!$E$20","999999=+Form54!$C$64","999999=+Form54!$C$66","999999=+Form54!$C$65","999999=+Form54!$C$67","999999=+Form54!$C$68","999999=+Form54!$C$60","999999=+Form54!$C$69","999999=+Form54!$C$70","999999=+Form54!$C$71","999999=+Form54!$I$48","999999=+Form54!$I$49","999999=+Form54!$I$50","999999=+Form54!$I$55","999999=+Form54!$J$55","999999=+Form54!$I$60","999999=+Form54!$I$61","999999=+Form54!$C$78","999999=+Form54!$C$79","999999=+Form54!$C$82","999999=+Form54!$C$126","999999=+Form54!$C$125","999999=+Form54!$C$124","999999=+Form54!$C$123","999999=+Form54!$C$95","999999=+Form54!$D$95","999999=+Form54!$C$96","999999=+Form54!$D$96","999999=+Form54!$C$97","999999=+Form54!$D$97","999999=+Form54!$D$98","999999=+Form54!$D$99","999999=+Form54!$D$100","999999=+Form54!$C$105","999999=+Form54!$D$105","999999=+Form54!$C$106","999999=+Form54!$D$106","999999=+Form54!$C$107","999999=+Form54!$D$107","999999=+Form54!$D$108","999999=+Form54!$D$109","999999=+Form54!$D$110","999999=+Form54!$E$95","999999=+Form54!$F$95","999999=+Form54!$E$96","999999=+Form54!$F$96","999999=+Form54!$E$97","999999=+Form54!$F$97","999999=+Form54!$F$98","999999=+Form54!$F$99","999999=+Form54!$F$100","999999=+Form54!$G$95","999999=+Form54!$H$95","999999=+Form54!$G$96","999999=+Form54!$H$96","999999=+Form54!$G$97","999999=+Form54!$H$97","999999=+Form54!$H$98","999999=+Form54!$H$99","999999=+Form54!$H$100",null,"999999=+Form54!$E$105","999999=+Form54!$F$105","999999=+Form54!$E$106","999999=+Form54!$F$106","999999=+Form54!$E$107","999999=+Form54!$F$107","999999=+Form54!$F$108","999999=+Form54!$F$109","999999=+Form54!$F$110","999999=+Form54!$G$105","999999=+Form54!$H$105","999999=+Form54!$G$106","999999=+Form54!$H$106","999999=+Form54!$G$107","999999=+Form54!$H$107","999999=+Form54!$H$108","999999=+Form54!$H$109","999999=+Form54!$H$110"]
["999999=+Form55!$C$8","999999=+Form55!$C$7","999999=+Form55!$C$25","999999=+Form55!$E$4","999999=+Form55!$C$37","999999=+Form55!$C$24","999999=+Form55!$C$26","999999=+Form55!$F$26","999999=+Form55!$C$27","999999=+Form55!$C$38","999999=+Form55!$C$39","999999=+Form55!$C$40","999999=+Form55!$C$17","999999=+Form55!$C$18","999999=+Form55!$F$18","999999=+Form55!$C$19","999999=+Form55!$C$20","999999=+Form55!$E$20","999999=+Form55!$C$64","999999=+Form55!$C$66","999999=+Form55!$C$65","999999=+Form55!$C$67","999999=+Form55!$C$68","999999=+Form55!$C$60","999999=+Form55!$C$69","999999=+Form55!$C$70","999999=+Form55!$C$71","999999=+Form55!$I$48","999999=+Form55!$I$49","999999=+Form55!$I$50","999999=+Form55!$I$55","999999=+Form55!$J$55","999999=+Form55!$I$60","999999=+Form55!$I$61","999999=+Form55!$C$78","999999=+Form55!$C$79","999999=+Form55!$C$82","999999=+Form55!$C$126","999999=+Form55!$C$125","999999=+Form55!$C$124","999999=+Form55!$C$123","999999=+Form55!$C$95","999999=+Form55!$D$95","999999=+Form55!$C$96","999999=+Form55!$D$96","999999=+Form55!$C$97","999999=+Form55!$D$97","999999=+Form55!$D$98","999999=+Form55!$D$99","999999=+Form55!$D$100","999999=+Form55!$C$105","999999=+Form55!$D$105","999999=+Form55!$C$106","999999=+Form55!$D$106","999999=+Form55!$C$107","999999=+Form55!$D$107","999999=+Form55!$D$108","999999=+Form55!$D$109","999999=+Form55!$D$110","999999=+Form55!$E$95","999999=+Form55!$F$95","999999=+Form55!$E$96","999999=+Form55!$F$96","999999=+Form55!$E$97","999999=+Form55!$F$97","999999=+Form55!$F$98","999999=+Form55!$F$99","999999=+Form55!$F$100","999999=+Form55!$G$95","999999=+Form55!$H$95","999999=+Form55!$G$96","999999=+Form55!$H$96","999999=+Form55!$G$97","999999=+Form55!$H$97","999999=+Form55!$H$98","999999=+Form55!$H$99","999999=+Form55!$H$100",null,"999999=+Form55!$E$105","999999=+Form55!$F$105","999999=+Form55!$E$106","999999=+Form55!$F$106","999999=+Form55!$E$107","999999=+Form55!$F$107","999999=+Form55!$F$108","999999=+Form55!$F$109","999999=+Form55!$F$110","999999=+Form55!$G$105","999999=+Form55!$H$105","999999=+Form55!$G$106","999999=+Form55!$H$106","999999=+Form55!$G$107","999999=+Form55!$H$107","999999=+Form55!$H$108","999999=+Form55!$H$109","999999=+Form55!$H$110"]
["999999=+Form56!$C$8","999999=+Form56!$C$7","999999=+Form56!$C$25","999999=+Form56!$E$4","999999=+Form56!$C$37","999999=+Form56!$C$24","999999=+Form56!$C$26","999999=+Form56!$F$26","999999=+Form56!$C$27","999999=+Form56!$C$38","999999=+Form56!$C$39","999999=+Form56!$C$40","999999=+Form56!$C$17","999999=+Form56!$C$18","999999=+Form56!$F$18","999999=+Form56!$C$19","999999=+Form56!$C$20","999999=+Form56!$E$20","999999=+Form56!$C$64","999999=+Form56!$C$66","999999=+Form56!$C$65","999999=+Form56!$C$67","999999=+Form56!$C$68","999999=+Form56!$C$60","999999=+Form56!$C$69","999999=+Form56!$C$70","999999=+Form56!$C$71","999999=+Form56!$I$48","999999=+Form56!$I$49","999999=+Form56!$I$50","999999=+Form56!$I$55","999999=+Form56!$J$55","999999=+Form56!$I$60","999999=+Form56!$I$61","999999=+Form56!$C$78","999999=+Form56!$C$79","999999=+Form56!$C$82","999999=+Form56!$C$126","999999=+Form56!$C$125","999999=+Form56!$C$124","999999=+Form56!$C$123","999999=+Form56!$C$95","999999=+Form56!$D$95","999999=+Form56!$C$96","999999=+Form56!$D$96","999999=+Form56!$C$97","999999=+Form56!$D$97","999999=+Form56!$D$98","999999=+Form56!$D$99","999999=+Form56!$D$100","999999=+Form56!$C$105","999999=+Form56!$D$105","999999=+Form56!$C$106","999999=+Form56!$D$106","999999=+Form56!$C$107","999999=+Form56!$D$107","999999=+Form56!$D$108","999999=+Form56!$D$109","999999=+Form56!$D$110","999999=+Form56!$E$95","999999=+Form56!$F$95","999999=+Form56!$E$96","999999=+Form56!$F$96","999999=+Form56!$E$97","999999=+Form56!$F$97","999999=+Form56!$F$98","999999=+Form56!$F$99","999999=+Form56!$F$100","999999=+Form56!$G$95","999999=+Form56!$H$95","999999=+Form56!$G$96","999999=+Form56!$H$96","999999=+Form56!$G$97","999999=+Form56!$H$97","999999=+Form56!$H$98","999999=+Form56!$H$99","999999=+Form56!$H$100",null,"999999=+Form56!$E$105","999999=+Form56!$F$105","999999=+Form56!$E$106","999999=+Form56!$F$106","999999=+Form56!$E$107","999999=+Form56!$F$107","999999=+Form56!$F$108","999999=+Form56!$F$109","999999=+Form56!$F$110","999999=+Form56!$G$105","999999=+Form56!$H$105","999999=+Form56!$G$106","999999=+Form56!$H$106","999999=+Form56!$G$107","999999=+Form56!$H$107","999999=+Form56!$H$108","999999=+Form56!$H$109","999999=+Form56!$H$110"]
["999999=+Form57!$C$8","999999=+Form57!$C$7","999999=+Form57!$C$25","999999=+Form57!$E$4","999999=+Form57!$C$37","999999=+Form57!$C$24","999999=+Form57!$C$26","999999=+Form57!$F$26","999999=+Form57!$C$27","999999=+Form57!$C$38","999999=+Form57!$C$39","999999=+Form57!$C$40","999999=+Form57!$C$17","999999=+Form57!$C$18","999999=+Form57!$F$18","999999=+Form57!$C$19","999999=+Form57!$C$20","999999=+Form57!$E$20","999999=+Form57!$C$64","999999=+Form57!$C$66","999999=+Form57!$C$65","999999=+Form57!$C$67","999999=+Form57!$C$68","999999=+Form57!$C$60","999999=+Form57!$C$69","999999=+Form57!$C$70","999999=+Form57!$C$71","999999=+Form57!$I$48","999999=+Form57!$I$49","999999=+Form57!$I$50","999999=+Form57!$I$55","999999=+Form57!$J$55","999999=+Form57!$I$60","999999=+Form57!$I$61","999999=+Form57!$C$78","999999=+Form57!$C$79","999999=+Form57!$C$82","999999=+Form57!$C$126","999999=+Form57!$C$125","999999=+Form57!$C$124","999999=+Form57!$C$123","999999=+Form57!$C$95","999999=+Form57!$D$95","999999=+Form57!$C$96","999999=+Form57!$D$96","999999=+Form57!$C$97","999999=+Form57!$D$97","999999=+Form57!$D$98","999999=+Form57!$D$99","999999=+Form57!$D$100","999999=+Form57!$C$105","999999=+Form57!$D$105","999999=+Form57!$C$106","999999=+Form57!$D$106","999999=+Form57!$C$107","999999=+Form57!$D$107","999999=+Form57!$D$108","999999=+Form57!$D$109","999999=+Form57!$D$110","999999=+Form57!$E$95","999999=+Form57!$F$95","999999=+Form57!$E$96","999999=+Form57!$F$96","999999=+Form57!$E$97","999999=+Form57!$F$97","999999=+Form57!$F$98","999999=+Form57!$F$99","999999=+Form57!$F$100","999999=+Form57!$G$95","999999=+Form57!$H$95","999999=+Form57!$G$96","999999=+Form57!$H$96","999999=+Form57!$G$97","999999=+Form57!$H$97","999999=+Form57!$H$98","999999=+Form57!$H$99","999999=+Form57!$H$100",null,"999999=+Form57!$E$105","999999=+Form57!$F$105","999999=+Form57!$E$106","999999=+Form57!$F$106","999999=+Form57!$E$107","999999=+Form57!$F$107","999999=+Form57!$F$108","999999=+Form57!$F$109","999999=+Form57!$F$110","999999=+Form57!$G$105","999999=+Form57!$H$105","999999=+Form57!$G$106","999999=+Form57!$H$106","999999=+Form57!$G$107","999999=+Form57!$H$107","999999=+Form57!$H$108","999999=+Form57!$H$109","999999=+Form57!$H$110"]
["999999=+Form58!$C$8","999999=+Form58!$C$7","999999=+Form58!$C$25","999999=+Form58!$E$4","999999=+Form58!$C$37","999999=+Form58!$C$24","999999=+Form58!$C$26","999999=+Form58!$F$26","999999=+Form58!$C$27","999999=+Form58!$C$38","999999=+Form58!$C$39","999999=+Form58!$C$40","999999=+Form58!$C$17","999999=+Form58!$C$18","999999=+Form58!$F$18","999999=+Form58!$C$19","999999=+Form58!$C$20","999999=+Form58!$E$20","999999=+Form58!$C$64","999999=+Form58!$C$66","999999=+Form58!$C$65","999999=+Form58!$C$67","999999=+Form58!$C$68","999999=+Form58!$C$60","999999=+Form58!$C$69","999999=+Form58!$C$70","999999=+Form58!$C$71","999999=+Form58!$I$48","999999=+Form58!$I$49","999999=+Form58!$I$50","999999=+Form58!$I$55","999999=+Form58!$J$55","999999=+Form58!$I$60","999999=+Form58!$I$61","999999=+Form58!$C$78","999999=+Form58!$C$79","999999=+Form58!$C$82","999999=+Form58!$C$126","999999=+Form58!$C$125","999999=+Form58!$C$124","999999=+Form58!$C$123","999999=+Form58!$C$95","999999=+Form58!$D$95","999999=+Form58!$C$96","999999=+Form58!$D$96","999999=+Form58!$C$97","999999=+Form58!$D$97","999999=+Form58!$D$98","999999=+Form58!$D$99","999999=+Form58!$D$100","999999=+Form58!$C$105","999999=+Form58!$D$105","999999=+Form58!$C$106","999999=+Form58!$D$106","999999=+Form58!$C$107","999999=+Form58!$D$107","999999=+Form58!$D$108","999999=+Form58!$D$109","999999=+Form58!$D$110","999999=+Form58!$E$95","999999=+Form58!$F$95","999999=+Form58!$E$96","999999=+Form58!$F$96","999999=+Form58!$E$97","999999=+Form58!$F$97","999999=+Form58!$F$98","999999=+Form58!$F$99","999999=+Form58!$F$100","999999=+Form58!$G$95","999999=+Form58!$H$95","999999=+Form58!$G$96","999999=+Form58!$H$96","999999=+Form58!$G$97","999999=+Form58!$H$97","999999=+Form58!$H$98","999999=+Form58!$H$99","999999=+Form58!$H$100",null,"999999=+Form58!$E$105","999999=+Form58!$F$105","999999=+Form58!$E$106","999999=+Form58!$F$106","999999=+Form58!$E$107","999999=+Form58!$F$107","999999=+Form58!$F$108","999999=+Form58!$F$109","999999=+Form58!$F$110","999999=+Form58!$G$105","999999=+Form58!$H$105","999999=+Form58!$G$106","999999=+Form58!$H$106","999999=+Form58!$G$107","999999=+Form58!$H$107","999999=+Form58!$H$108","999999=+Form58!$H$109","999999=+Form58!$H$110"]
["999999=+Form59!$C$8","999999=+Form59!$C$7","999999=+Form59!$C$25","999999=+Form59!$E$4","999999=+Form59!$C$37","999999=+Form59!$C$24","999999=+Form59!$C$26","999999=+Form59!$F$26","999999=+Form59!$C$27","999999=+Form59!$C$38","999999=+Form59!$C$39","999999=+Form59!$C$40","999999=+Form59!$C$17","999999=+Form59!$C$18","999999=+Form59!$F$18","999999=+Form59!$C$19","999999=+Form59!$C$20","999999=+Form59!$E$20","999999=+Form59!$C$64","999999=+Form59!$C$66","999999=+Form59!$C$65","999999=+Form59!$C$67","999999=+Form59!$C$68","999999=+Form59!$C$60","999999=+Form59!$C$69","999999=+Form59!$C$70","999999=+Form59!$C$71","999999=+Form59!$I$48","999999=+Form59!$I$49","999999=+Form59!$I$50","999999=+Form59!$I$55","999999=+Form59!$J$55","999999=+Form59!$I$60","999999=+Form59!$I$61","999999=+Form59!$C$78","999999=+Form59!$C$79","999999=+Form59!$C$82","999999=+Form59!$C$126","999999=+Form59!$C$125","999999=+Form59!$C$124","999999=+Form59!$C$123","999999=+Form59!$C$95","999999=+Form59!$D$95","999999=+Form59!$C$96","999999=+Form59!$D$96","999999=+Form59!$C$97","999999=+Form59!$D$97","999999=+Form59!$D$98","999999=+Form59!$D$99","999999=+Form59!$D$100","999999=+Form59!$C$105","999999=+Form59!$D$105","999999=+Form59!$C$106","999999=+Form59!$D$106","999999=+Form59!$C$107","999999=+Form59!$D$107","999999=+Form59!$D$108","999999=+Form59!$D$109","999999=+Form59!$D$110","999999=+Form59!$E$95","999999=+Form59!$F$95","999999=+Form59!$E$96","999999=+Form59!$F$96","999999=+Form59!$E$97","999999=+Form59!$F$97","999999=+Form59!$F$98","999999=+Form59!$F$99","999999=+Form59!$F$100","999999=+Form59!$G$95","999999=+Form59!$H$95","999999=+Form59!$G$96","999999=+Form59!$H$96","999999=+Form59!$G$97","999999=+Form59!$H$97","999999=+Form59!$H$98","999999=+Form59!$H$99","999999=+Form59!$H$100",null,"999999=+Form59!$E$105","999999=+Form59!$F$105","999999=+Form59!$E$106","999999=+Form59!$F$106","999999=+Form59!$E$107","999999=+Form59!$F$107","999999=+Form59!$F$108","999999=+Form59!$F$109","999999=+Form59!$F$110","999999=+Form59!$G$105","999999=+Form59!$H$105","999999=+Form59!$G$106","999999=+Form59!$H$106","999999=+Form59!$G$107","999999=+Form59!$H$107","999999=+Form59!$H$108","999999=+Form59!$H$109","999999=+Form59!$H$110"]
["999999=+Form60!$C$8","999999=+Form60!$C$7","999999=+Form60!$C$25","999999=+Form60!$E$4","999999=+Form60!$C$37","999999=+Form60!$C$24","999999=+Form60!$C$26","999999=+Form60!$F$26","999999=+Form60!$C$27","999999=+Form60!$C$38","999999=+Form60!$C$39","999999=+Form60!$C$40","999999=+Form60!$C$17","999999=+Form60!$C$18","999999=+Form60!$F$18","999999=+Form60!$C$19","999999=+Form60!$C$20","999999=+Form60!$E$20","999999=+Form60!$C$64","999999=+Form60!$C$66","999999=+Form60!$C$65","999999=+Form60!$C$67","999999=+Form60!$C$68","999999=+Form60!$C$60","999999=+Form60!$C$69","999999=+Form60!$C$70","999999=+Form60!$C$71","999999=+Form60!$I$48","999999=+Form60!$I$49","999999=+Form60!$I$50","999999=+Form60!$I$55","999999=+Form60!$J$55","999999=+Form60!$I$60","999999=+Form60!$I$61","999999=+Form60!$C$78","999999=+Form60!$C$79","999999=+Form60!$C$82","999999=+Form60!$C$126","999999=+Form60!$C$125","999999=+Form60!$C$124","999999=+Form60!$C$123","999999=+Form60!$C$95","999999=+Form60!$D$95","999999=+Form60!$C$96","999999=+Form60!$D$96","999999=+Form60!$C$97","999999=+Form60!$D$97","999999=+Form60!$D$98","999999=+Form60!$D$99","999999=+Form60!$D$100","999999=+Form60!$C$105","999999=+Form60!$D$105","999999=+Form60!$C$106","999999=+Form60!$D$106","999999=+Form60!$C$107","999999=+Form60!$D$107","999999=+Form60!$D$108","999999=+Form60!$D$109","999999=+Form60!$D$110","999999=+Form60!$E$95","999999=+Form60!$F$95","999999=+Form60!$E$96","999999=+Form60!$F$96","999999=+Form60!$E$97","999999=+Form60!$F$97","999999=+Form60!$F$98","999999=+Form60!$F$99","999999=+Form60!$F$100","999999=+Form60!$G$95","999999=+Form60!$H$95","999999=+Form60!$G$96","999999=+Form60!$H$96","999999=+Form60!$G$97","999999=+Form60!$H$97","999999=+Form60!$H$98","999999=+Form60!$H$99","999999=+Form60!$H$100",null,"999999=+Form60!$E$105","999999=+Form60!$F$105","999999=+Form60!$E$106","999999=+Form60!$F$106","999999=+Form60!$E$107","999999=+Form60!$F$107","999999=+Form60!$F$108","999999=+Form60!$F$109","999999=+Form60!$F$110","999999=+Form60!$G$105","999999=+Form60!$H$105","999999=+Form60!$G$106","999999=+Form60!$H$106","999999=+Form60!$G$107","999999=+Form60!$H$107","999999=+Form60!$H$108","999999=+Form60!$H$109","999999=+Form60!$H$110"]
["999999=+Form61!$C$8","999999=+Form61!$C$7","999999=+Form61!$C$25","999999=+Form61!$E$4","999999=+Form61!$C$37","999999=+Form61!$C$24","999999=+Form61!$C$26","999999=+Form61!$F$26","999999=+Form61!$C$27","999999=+Form61!$C$38","999999=+Form61!$C$39","999999=+Form61!$C$40","999999=+Form61!$C$17","999999=+Form61!$C$18","999999=+Form61!$F$18","999999=+Form61!$C$19","999999=+Form61!$C$20","999999=+Form61!$E$20","999999=+Form61!$C$64","999999=+Form61!$C$66","999999=+Form61!$C$65","999999=+Form61!$C$67","999999=+Form61!$C$68","999999=+Form61!$C$60","999999=+Form61!$C$69","999999=+Form61!$C$70","999999=+Form61!$C$71","999999=+Form61!$I$48","999999=+Form61!$I$49","999999=+Form61!$I$50","999999=+Form61!$I$55","999999=+Form61!$J$55","999999=+Form61!$I$60","999999=+Form61!$I$61","999999=+Form61!$C$78","999999=+Form61!$C$79","999999=+Form61!$C$82","999999=+Form61!$C$126","999999=+Form61!$C$125","999999=+Form61!$C$124","999999=+Form61!$C$123","999999=+Form61!$C$95","999999=+Form61!$D$95","999999=+Form61!$C$96","999999=+Form61!$D$96","999999=+Form61!$C$97","999999=+Form61!$D$97","999999=+Form61!$D$98","999999=+Form61!$D$99","999999=+Form61!$D$100","999999=+Form61!$C$105","999999=+Form61!$D$105","999999=+Form61!$C$106","999999=+Form61!$D$106","999999=+Form61!$C$107","999999=+Form61!$D$107","999999=+Form61!$D$108","999999=+Form61!$D$109","999999=+Form61!$D$110","999999=+Form61!$E$95","999999=+Form61!$F$95","999999=+Form61!$E$96","999999=+Form61!$F$96","999999=+Form61!$E$97","999999=+Form61!$F$97","999999=+Form61!$F$98","999999=+Form61!$F$99","999999=+Form61!$F$100","999999=+Form61!$G$95","999999=+Form61!$H$95","999999=+Form61!$G$96","999999=+Form61!$H$96","999999=+Form61!$G$97","999999=+Form61!$H$97","999999=+Form61!$H$98","999999=+Form61!$H$99","999999=+Form61!$H$100",null,"999999=+Form61!$E$105","999999=+Form61!$F$105","999999=+Form61!$E$106","999999=+Form61!$F$106","999999=+Form61!$E$107","999999=+Form61!$F$107","999999=+Form61!$F$108","999999=+Form61!$F$109","999999=+Form61!$F$110","999999=+Form61!$G$105","999999=+Form61!$H$105","999999=+Form61!$G$106","999999=+Form61!$H$106","999999=+Form61!$G$107","999999=+Form61!$H$107","999999=+Form61!$H$108","999999=+Form61!$H$109","999999=+Form61!$H$110"]
["999999=+Form62!$C$8","999999=+Form62!$C$7","999999=+Form62!$C$25","999999=+Form62!$E$4","999999=+Form62!$C$37","999999=+Form62!$C$24","999999=+Form62!$C$26","999999=+Form62!$F$26","999999=+Form62!$C$27","999999=+Form62!$C$38","999999=+Form62!$C$39","999999=+Form62!$C$40","999999=+Form62!$C$17","999999=+Form62!$C$18","999999=+Form62!$F$18","999999=+Form62!$C$19","999999=+Form62!$C$20","999999=+Form62!$E$20","999999=+Form62!$C$64","999999=+Form62!$C$66","999999=+Form62!$C$65","999999=+Form62!$C$67","999999=+Form62!$C$68","999999=+Form62!$C$60","999999=+Form62!$C$69","999999=+Form62!$C$70","999999=+Form62!$C$71","999999=+Form62!$I$48","999999=+Form62!$I$49","999999=+Form62!$I$50","999999=+Form62!$I$55","999999=+Form62!$J$55","999999=+Form62!$I$60","999999=+Form62!$I$61","999999=+Form62!$C$78","999999=+Form62!$C$79","999999=+Form62!$C$82","999999=+Form62!$C$126","999999=+Form62!$C$125","999999=+Form62!$C$124","999999=+Form62!$C$123","999999=+Form62!$C$95","999999=+Form62!$D$95","999999=+Form62!$C$96","999999=+Form62!$D$96","999999=+Form62!$C$97","999999=+Form62!$D$97","999999=+Form62!$D$98","999999=+Form62!$D$99","999999=+Form62!$D$100","999999=+Form62!$C$105","999999=+Form62!$D$105","999999=+Form62!$C$106","999999=+Form62!$D$106","999999=+Form62!$C$107","999999=+Form62!$D$107","999999=+Form62!$D$108","999999=+Form62!$D$109","999999=+Form62!$D$110","999999=+Form62!$E$95","999999=+Form62!$F$95","999999=+Form62!$E$96","999999=+Form62!$F$96","999999=+Form62!$E$97","999999=+Form62!$F$97","999999=+Form62!$F$98","999999=+Form62!$F$99","999999=+Form62!$F$100","999999=+Form62!$G$95","999999=+Form62!$H$95","999999=+Form62!$G$96","999999=+Form62!$H$96","999999=+Form62!$G$97","999999=+Form62!$H$97","999999=+Form62!$H$98","999999=+Form62!$H$99","999999=+Form62!$H$100",null,"999999=+Form62!$E$105","999999=+Form62!$F$105","999999=+Form62!$E$106","999999=+Form62!$F$106","999999=+Form62!$E$107","999999=+Form62!$F$107","999999=+Form62!$F$108","999999=+Form62!$F$109","999999=+Form62!$F$110","999999=+Form62!$G$105","999999=+Form62!$H$105","999999=+Form62!$G$106","999999=+Form62!$H$106","999999=+Form62!$G$107","999999=+Form62!$H$107","999999=+Form62!$H$108","999999=+Form62!$H$109","999999=+Form62!$H$110"]
["999999=+Form63!$C$8","999999=+Form63!$C$7","999999=+Form63!$C$25","999999=+Form63!$E$4","999999=+Form63!$C$37","999999=+Form63!$C$24","999999=+Form63!$C$26","999999=+Form63!$F$26","999999=+Form63!$C$27","999999=+Form63!$C$38","999999=+Form63!$C$39","999999=+Form63!$C$40","999999=+Form63!$C$17","999999=+Form63!$C$18","999999=+Form63!$F$18","999999=+Form63!$C$19","999999=+Form63!$C$20","999999=+Form63!$E$20","999999=+Form63!$C$64","999999=+Form63!$C$66","999999=+Form63!$C$65","999999=+Form63!$C$67","999999=+Form63!$C$68","999999=+Form63!$C$60","999999=+Form63!$C$69","999999=+Form63!$C$70","999999=+Form63!$C$71","999999=+Form63!$I$48","999999=+Form63!$I$49","999999=+Form63!$I$50","999999=+Form63!$I$55","999999=+Form63!$J$55","999999=+Form63!$I$60","999999=+Form63!$I$61","999999=+Form63!$C$78","999999=+Form63!$C$79","999999=+Form63!$C$82","999999=+Form63!$C$126","999999=+Form63!$C$125","999999=+Form63!$C$124","999999=+Form63!$C$123","999999=+Form63!$C$95","999999=+Form63!$D$95","999999=+Form63!$C$96","999999=+Form63!$D$96","999999=+Form63!$C$97","999999=+Form63!$D$97","999999=+Form63!$D$98","999999=+Form63!$D$99","999999=+Form63!$D$100","999999=+Form63!$C$105","999999=+Form63!$D$105","999999=+Form63!$C$106","999999=+Form63!$D$106","999999=+Form63!$C$107","999999=+Form63!$D$107","999999=+Form63!$D$108","999999=+Form63!$D$109","999999=+Form63!$D$110","999999=+Form63!$E$95","999999=+Form63!$F$95","999999=+Form63!$E$96","999999=+Form63!$F$96","999999=+Form63!$E$97","999999=+Form63!$F$97","999999=+Form63!$F$98","999999=+Form63!$F$99","999999=+Form63!$F$100","999999=+Form63!$G$95","999999=+Form63!$H$95","999999=+Form63!$G$96","999999=+Form63!$H$96","999999=+Form63!$G$97","999999=+Form63!$H$97","999999=+Form63!$H$98","999999=+Form63!$H$99","999999=+Form63!$H$100",null,"999999=+Form63!$E$105","999999=+Form63!$F$105","999999=+Form63!$E$106","999999=+Form63!$F$106","999999=+Form63!$E$107","999999=+Form63!$F$107","999999=+Form63!$F$108","999999=+Form63!$F$109","999999=+Form63!$F$110","999999=+Form63!$G$105","999999=+Form63!$H$105","999999=+Form63!$G$106","999999=+Form63!$H$106","999999=+Form63!$G$107","999999=+Form63!$H$107","999999=+Form63!$H$108","999999=+Form63!$H$109","999999=+Form63!$H$110"]
["999999=+Form64!$C$8","999999=+Form64!$C$7","999999=+Form64!$C$25","999999=+Form64!$E$4","999999=+Form64!$C$37","999999=+Form64!$C$24","999999=+Form64!$C$26","999999=+Form64!$F$26","999999=+Form64!$C$27","999999=+Form64!$C$38","999999=+Form64!$C$39","999999=+Form64!$C$40","999999=+Form64!$C$17","999999=+Form64!$C$18","999999=+Form64!$F$18","999999=+Form64!$C$19","999999=+Form64!$C$20","999999=+Form64!$E$20","999999=+Form64!$C$64","999999=+Form64!$C$66","999999=+Form64!$C$65","999999=+Form64!$C$67","999999=+Form64!$C$68","999999=+Form64!$C$60","999999=+Form64!$C$69","999999=+Form64!$C$70","999999=+Form64!$C$71","999999=+Form64!$I$48","999999=+Form64!$I$49","999999=+Form64!$I$50","999999=+Form64!$I$55","999999=+Form64!$J$55","999999=+Form64!$I$60","999999=+Form64!$I$61","999999=+Form64!$C$78","999999=+Form64!$C$79","999999=+Form64!$C$82","999999=+Form64!$C$126","999999=+Form64!$C$125","999999=+Form64!$C$124","999999=+Form64!$C$123","999999=+Form64!$C$95","999999=+Form64!$D$95","999999=+Form64!$C$96","999999=+Form64!$D$96","999999=+Form64!$C$97","999999=+Form64!$D$97","999999=+Form64!$D$98","999999=+Form64!$D$99","999999=+Form64!$D$100","999999=+Form64!$C$105","999999=+Form64!$D$105","999999=+Form64!$C$106","999999=+Form64!$D$106","999999=+Form64!$C$107","999999=+Form64!$D$107","999999=+Form64!$D$108","999999=+Form64!$D$109","999999=+Form64!$D$110","999999=+Form64!$E$95","999999=+Form64!$F$95","999999=+Form64!$E$96","999999=+Form64!$F$96","999999=+Form64!$E$97","999999=+Form64!$F$97","999999=+Form64!$F$98","999999=+Form64!$F$99","999999=+Form64!$F$100","999999=+Form64!$G$95","999999=+Form64!$H$95","999999=+Form64!$G$96","999999=+Form64!$H$96","999999=+Form64!$G$97","999999=+Form64!$H$97","999999=+Form64!$H$98","999999=+Form64!$H$99","999999=+Form64!$H$100",null,"999999=+Form64!$E$105","999999=+Form64!$F$105","999999=+Form64!$E$106","999999=+Form64!$F$106","999999=+Form64!$E$107","999999=+Form64!$F$107","999999=+Form64!$F$108","999999=+Form64!$F$109","999999=+Form64!$F$110","999999=+Form64!$G$105","999999=+Form64!$H$105","999999=+Form64!$G$106","999999=+Form64!$H$106","999999=+Form64!$G$107","999999=+Form64!$H$107","999999=+Form64!$H$108","999999=+Form64!$H$109","999999=+Form64!$H$110"]
["999999=+Form65!$C$8","999999=+Form65!$C$7","999999=+Form65!$C$25","999999=+Form65!$E$4","999999=+Form65!$C$37","999999=+Form65!$C$24","999999=+Form65!$C$26","999999=+Form65!$F$26","999999=+Form65!$C$27","999999=+Form65!$C$38","999999=+Form65!$C$39","999999=+Form65!$C$40","999999=+Form65!$C$17","999999=+Form65!$C$18","999999=+Form65!$F$18","999999=+Form65!$C$19","999999=+Form65!$C$20","999999=+Form65!$E$20","999999=+Form65!$C$64","999999=+Form65!$C$66","999999=+Form65!$C$65","999999=+Form65!$C$67","999999=+Form65!$C$68","999999=+Form65!$C$60","999999=+Form65!$C$69","999999=+Form65!$C$70","999999=+Form65!$C$71","999999=+Form65!$I$48","999999=+Form65!$I$49","999999=+Form65!$I$50","999999=+Form65!$I$55","999999=+Form65!$J$55","999999=+Form65!$I$60","999999=+Form65!$I$61","999999=+Form65!$C$78","999999=+Form65!$C$79","999999=+Form65!$C$82","999999=+Form65!$C$126","999999=+Form65!$C$125","999999=+Form65!$C$124","999999=+Form65!$C$123","999999=+Form65!$C$95","999999=+Form65!$D$95","999999=+Form65!$C$96","999999=+Form65!$D$96","999999=+Form65!$C$97","999999=+Form65!$D$97","999999=+Form65!$D$98","999999=+Form65!$D$99","999999=+Form65!$D$100","999999=+Form65!$C$105","999999=+Form65!$D$105","999999=+Form65!$C$106","999999=+Form65!$D$106","999999=+Form65!$C$107","999999=+Form65!$D$107","999999=+Form65!$D$108","999999=+Form65!$D$109","999999=+Form65!$D$110","999999=+Form65!$E$95","999999=+Form65!$F$95","999999=+Form65!$E$96","999999=+Form65!$F$96","999999=+Form65!$E$97","999999=+Form65!$F$97","999999=+Form65!$F$98","999999=+Form65!$F$99","999999=+Form65!$F$100","999999=+Form65!$G$95","999999=+Form65!$H$95","999999=+Form65!$G$96","999999=+Form65!$H$96","999999=+Form65!$G$97","999999=+Form65!$H$97","999999=+Form65!$H$98","999999=+Form65!$H$99","999999=+Form65!$H$100",null,"999999=+Form65!$E$105","999999=+Form65!$F$105","999999=+Form65!$E$106","999999=+Form65!$F$106","999999=+Form65!$E$107","999999=+Form65!$F$107","999999=+Form65!$F$108","999999=+Form65!$F$109","999999=+Form65!$F$110","999999=+Form65!$G$105","999999=+Form65!$H$105","999999=+Form65!$G$106","999999=+Form65!$H$106","999999=+Form65!$G$107","999999=+Form65!$H$107","999999=+Form65!$H$108","999999=+Form65!$H$109","999999=+Form65!$H$110"]
["999999=+Form66!$C$8","999999=+Form66!$C$7","999999=+Form66!$C$25","999999=+Form66!$E$4","999999=+Form66!$C$37","999999=+Form66!$C$24","999999=+Form66!$C$26","999999=+Form66!$F$26","999999=+Form66!$C$27","999999=+Form66!$C$38","999999=+Form66!$C$39","999999=+Form66!$C$40","999999=+Form66!$C$17","999999=+Form66!$C$18","999999=+Form66!$F$18","999999=+Form66!$C$19","999999=+Form66!$C$20","999999=+Form66!$E$20","999999=+Form66!$C$64","999999=+Form66!$C$66","999999=+Form66!$C$65","999999=+Form66!$C$67","999999=+Form66!$C$68","999999=+Form66!$C$60","999999=+Form66!$C$69","999999=+Form66!$C$70","999999=+Form66!$C$71","999999=+Form66!$I$48","999999=+Form66!$I$49","999999=+Form66!$I$50","999999=+Form66!$I$55","999999=+Form66!$J$55","999999=+Form66!$I$60","999999=+Form66!$I$61","999999=+Form66!$C$78","999999=+Form66!$C$79","999999=+Form66!$C$82","999999=+Form66!$C$126","999999=+Form66!$C$125","999999=+Form66!$C$124","999999=+Form66!$C$123","999999=+Form66!$C$95","999999=+Form66!$D$95","999999=+Form66!$C$96","999999=+Form66!$D$96","999999=+Form66!$C$97","999999=+Form66!$D$97","999999=+Form66!$D$98","999999=+Form66!$D$99","999999=+Form66!$D$100","999999=+Form66!$C$105","999999=+Form66!$D$105","999999=+Form66!$C$106","999999=+Form66!$D$106","999999=+Form66!$C$107","999999=+Form66!$D$107","999999=+Form66!$D$108","999999=+Form66!$D$109","999999=+Form66!$D$110","999999=+Form66!$E$95","999999=+Form66!$F$95","999999=+Form66!$E$96","999999=+Form66!$F$96","999999=+Form66!$E$97","999999=+Form66!$F$97","999999=+Form66!$F$98","999999=+Form66!$F$99","999999=+Form66!$F$100","999999=+Form66!$G$95","999999=+Form66!$H$95","999999=+Form66!$G$96","999999=+Form66!$H$96","999999=+Form66!$G$97","999999=+Form66!$H$97","999999=+Form66!$H$98","999999=+Form66!$H$99","999999=+Form66!$H$100",null,"999999=+Form66!$E$105","999999=+Form66!$F$105","999999=+Form66!$E$106","999999=+Form66!$F$106","999999=+Form66!$E$107","999999=+Form66!$F$107","999999=+Form66!$F$108","999999=+Form66!$F$109","999999=+Form66!$F$110","999999=+Form66!$G$105","999999=+Form66!$H$105","999999=+Form66!$G$106","999999=+Form66!$H$106","999999=+Form66!$G$107","999999=+Form66!$H$107","999999=+Form66!$H$108","999999=+Form66!$H$109","999999=+Form66!$H$110"]
["999999=+Form67!$C$8","999999=+Form67!$C$7","999999=+Form67!$C$25","999999=+Form67!$E$4","999999=+Form67!$C$37","999999=+Form67!$C$24","999999=+Form67!$C$26","999999=+Form67!$F$26","999999=+Form67!$C$27","999999=+Form67!$C$38","999999=+Form67!$C$39","999999=+Form67!$C$40","999999=+Form67!$C$17","999999=+Form67!$C$18","999999=+Form67!$F$18","999999=+Form67!$C$19","999999=+Form67!$C$20","999999=+Form67!$E$20","999999=+Form67!$C$64","999999=+Form67!$C$66","999999=+Form67!$C$65","999999=+Form67!$C$67","999999=+Form67!$C$68","999999=+Form67!$C$60","999999=+Form67!$C$69","999999=+Form67!$C$70","999999=+Form67!$C$71","999999=+Form67!$I$48","999999=+Form67!$I$49","999999=+Form67!$I$50","999999=+Form67!$I$55","999999=+Form67!$J$55","999999=+Form67!$I$60","999999=+Form67!$I$61","999999=+Form67!$C$78","999999=+Form67!$C$79","999999=+Form67!$C$82","999999=+Form67!$C$126","999999=+Form67!$C$125","999999=+Form67!$C$124","999999=+Form67!$C$123","999999=+Form67!$C$95","999999=+Form67!$D$95","999999=+Form67!$C$96","999999=+Form67!$D$96","999999=+Form67!$C$97","999999=+Form67!$D$97","999999=+Form67!$D$98","999999=+Form67!$D$99","999999=+Form67!$D$100","999999=+Form67!$C$105","999999=+Form67!$D$105","999999=+Form67!$C$106","999999=+Form67!$D$106","999999=+Form67!$C$107","999999=+Form67!$D$107","999999=+Form67!$D$108","999999=+Form67!$D$109","999999=+Form67!$D$110","999999=+Form67!$E$95","999999=+Form67!$F$95","999999=+Form67!$E$96","999999=+Form67!$F$96","999999=+Form67!$E$97","999999=+Form67!$F$97","999999=+Form67!$F$98","999999=+Form67!$F$99","999999=+Form67!$F$100","999999=+Form67!$G$95","999999=+Form67!$H$95","999999=+Form67!$G$96","999999=+Form67!$H$96","999999=+Form67!$G$97","999999=+Form67!$H$97","999999=+Form67!$H$98","999999=+Form67!$H$99","999999=+Form67!$H$100",null,"999999=+Form67!$E$105","999999=+Form67!$F$105","999999=+Form67!$E$106","999999=+Form67!$F$106","999999=+Form67!$E$107","999999=+Form67!$F$107","999999=+Form67!$F$108","999999=+Form67!$F$109","999999=+Form67!$F$110","999999=+Form67!$G$105","999999=+Form67!$H$105","999999=+Form67!$G$106","999999=+Form67!$H$106","999999=+Form67!$G$107","999999=+Form67!$H$107","999999=+Form67!$H$108","999999=+Form67!$H$109","999999=+Form67!$H$110"]
["999999=+Form68!$C$8","999999=+Form68!$C$7","999999=+Form68!$C$25","999999=+Form68!$E$4","999999=+Form68!$C$37","999999=+Form68!$C$24","999999=+Form68!$C$26","999999=+Form68!$F$26","999999=+Form68!$C$27","999999=+Form68!$C$38","999999=+Form68!$C$39","999999=+Form68!$C$40","999999=+Form68!$C$17","999999=+Form68!$C$18","999999=+Form68!$F$18","999999=+Form68!$C$19","999999=+Form68!$C$20","999999=+Form68!$E$20","999999=+Form68!$C$64","999999=+Form68!$C$66","999999=+Form68!$C$65","999999=+Form68!$C$67","999999=+Form68!$C$68","999999=+Form68!$C$60","999999=+Form68!$C$69","999999=+Form68!$C$70","999999=+Form68!$C$71","999999=+Form68!$I$48","999999=+Form68!$I$49","999999=+Form68!$I$50","999999=+Form68!$I$55","999999=+Form68!$J$55","999999=+Form68!$I$60","999999=+Form68!$I$61","999999=+Form68!$C$78","999999=+Form68!$C$79","999999=+Form68!$C$82","999999=+Form68!$C$126","999999=+Form68!$C$125","999999=+Form68!$C$124","999999=+Form68!$C$123","999999=+Form68!$C$95","999999=+Form68!$D$95","999999=+Form68!$C$96","999999=+Form68!$D$96","999999=+Form68!$C$97","999999=+Form68!$D$97","999999=+Form68!$D$98","999999=+Form68!$D$99","999999=+Form68!$D$100","999999=+Form68!$C$105","999999=+Form68!$D$105","999999=+Form68!$C$106","999999=+Form68!$D$106","999999=+Form68!$C$107","999999=+Form68!$D$107","999999=+Form68!$D$108","999999=+Form68!$D$109","999999=+Form68!$D$110","999999=+Form68!$E$95","999999=+Form68!$F$95","999999=+Form68!$E$96","999999=+Form68!$F$96","999999=+Form68!$E$97","999999=+Form68!$F$97","999999=+Form68!$F$98","999999=+Form68!$F$99","999999=+Form68!$F$100","999999=+Form68!$G$95","999999=+Form68!$H$95","999999=+Form68!$G$96","999999=+Form68!$H$96","999999=+Form68!$G$97","999999=+Form68!$H$97","999999=+Form68!$H$98","999999=+Form68!$H$99","999999=+Form68!$H$100",null,"999999=+Form68!$E$105","999999=+Form68!$F$105","999999=+Form68!$E$106","999999=+Form68!$F$106","999999=+Form68!$E$107","999999=+Form68!$F$107","999999=+Form68!$F$108","999999=+Form68!$F$109","999999=+Form68!$F$110","999999=+Form68!$G$105","999999=+Form68!$H$105","999999=+Form68!$G$106","999999=+Form68!$H$106","999999=+Form68!$G$107","999999=+Form68!$H$107","999999=+Form68!$H$108","999999=+Form68!$H$109","999999=+Form68!$H$110"]
["999999=+Form69!$C$8","999999=+Form69!$C$7","999999=+Form69!$C$25","999999=+Form69!$E$4","999999=+Form69!$C$37","999999=+Form69!$C$24","999999=+Form69!$C$26","999999=+Form69!$F$26","999999=+Form69!$C$27","999999=+Form69!$C$38","999999=+Form69!$C$39","999999=+Form69!$C$40","999999=+Form69!$C$17","999999=+Form69!$C$18","999999=+Form69!$F$18","999999=+Form69!$C$19","999999=+Form69!$C$20","999999=+Form69!$E$20","999999=+Form69!$C$64","999999=+Form69!$C$66","999999=+Form69!$C$65","999999=+Form69!$C$67","999999=+Form69!$C$68","999999=+Form69!$C$60","999999=+Form69!$C$69","999999=+Form69!$C$70","999999=+Form69!$C$71","999999=+Form69!$I$48","999999=+Form69!$I$49","999999=+Form69!$I$50","999999=+Form69!$I$55","999999=+Form69!$J$55","999999=+Form69!$I$60","999999=+Form69!$I$61","999999=+Form69!$C$78","999999=+Form69!$C$79","999999=+Form69!$C$82","999999=+Form69!$C$126","999999=+Form69!$C$125","999999=+Form69!$C$124","999999=+Form69!$C$123","999999=+Form69!$C$95","999999=+Form69!$D$95","999999=+Form69!$C$96","999999=+Form69!$D$96","999999=+Form69!$C$97","999999=+Form69!$D$97","999999=+Form69!$D$98","999999=+Form69!$D$99","999999=+Form69!$D$100","999999=+Form69!$C$105","999999=+Form69!$D$105","999999=+Form69!$C$106","999999=+Form69!$D$106","999999=+Form69!$C$107","999999=+Form69!$D$107","999999=+Form69!$D$108","999999=+Form69!$D$109","999999=+Form69!$D$110","999999=+Form69!$E$95","999999=+Form69!$F$95","999999=+Form69!$E$96","999999=+Form69!$F$96","999999=+Form69!$E$97","999999=+Form69!$F$97","999999=+Form69!$F$98","999999=+Form69!$F$99","999999=+Form69!$F$100","999999=+Form69!$G$95","999999=+Form69!$H$95","999999=+Form69!$G$96","999999=+Form69!$H$96","999999=+Form69!$G$97","999999=+Form69!$H$97","999999=+Form69!$H$98","999999=+Form69!$H$99","999999=+Form69!$H$100",null,"999999=+Form69!$E$105","999999=+Form69!$F$105","999999=+Form69!$E$106","999999=+Form69!$F$106","999999=+Form69!$E$107","999999=+Form69!$F$107","999999=+Form69!$F$108","999999=+Form69!$F$109","999999=+Form69!$F$110","999999=+Form69!$G$105","999999=+Form69!$H$105","999999=+Form69!$G$106","999999=+Form69!$H$106","999999=+Form69!$G$107","999999=+Form69!$H$107","999999=+Form69!$H$108","999999=+Form69!$H$109","999999=+Form69!$H$110"]
["999999=+Form70!$C$8","999999=+Form70!$C$7","999999=+Form70!$C$25","999999=+Form70!$E$4","999999=+Form70!$C$37","999999=+Form70!$C$24","999999=+Form70!$C$26","999999=+Form70!$F$26","999999=+Form70!$C$27","999999=+Form70!$C$38","999999=+Form70!$C$39","999999=+Form70!$C$40","999999=+Form70!$C$17","999999=+Form70!$C$18","999999=+Form70!$F$18","999999=+Form70!$C$19","999999=+Form70!$C$20","999999=+Form70!$E$20","999999=+Form70!$C$64","999999=+Form70!$C$66","999999=+Form70!$C$65","999999=+Form70!$C$67","999999=+Form70!$C$68","999999=+Form70!$C$60","999999=+Form70!$C$69","999999=+Form70!$C$70","999999=+Form70!$C$71","999999=+Form70!$I$48","999999=+Form70!$I$49","999999=+Form70!$I$50","999999=+Form70!$I$55","999999=+Form70!$J$55","999999=+Form70!$I$60","999999=+Form70!$I$61","999999=+Form70!$C$78","999999=+Form70!$C$79","999999=+Form70!$C$82","999999=+Form70!$C$126","999999=+Form70!$C$125","999999=+Form70!$C$124","999999=+Form70!$C$123","999999=+Form70!$C$95","999999=+Form70!$D$95","999999=+Form70!$C$96","999999=+Form70!$D$96","999999=+Form70!$C$97","999999=+Form70!$D$97","999999=+Form70!$D$98","999999=+Form70!$D$99","999999=+Form70!$D$100","999999=+Form70!$C$105","999999=+Form70!$D$105","999999=+Form70!$C$106","999999=+Form70!$D$106","999999=+Form70!$C$107","999999=+Form70!$D$107","999999=+Form70!$D$108","999999=+Form70!$D$109","999999=+Form70!$D$110","999999=+Form70!$E$95","999999=+Form70!$F$95","999999=+Form70!$E$96","999999=+Form70!$F$96","999999=+Form70!$E$97","999999=+Form70!$F$97","999999=+Form70!$F$98","999999=+Form70!$F$99","999999=+Form70!$F$100","999999=+Form70!$G$95","999999=+Form70!$H$95","999999=+Form70!$G$96","999999=+Form70!$H$96","999999=+Form70!$G$97","999999=+Form70!$H$97","999999=+Form70!$H$98","999999=+Form70!$H$99","999999=+Form70!$H$100",null,"999999=+Form70!$E$105","999999=+Form70!$F$105","999999=+Form70!$E$106","999999=+Form70!$F$106","999999=+Form70!$E$107","999999=+Form70!$F$107","999999=+Form70!$F$108","999999=+Form70!$F$109","999999=+Form70!$F$110","999999=+Form70!$G$105","999999=+Form70!$H$105","999999=+Form70!$G$106","999999=+Form70!$H$106","999999=+Form70!$G$107","999999=+Form70!$H$107","999999=+Form70!$H$108","999999=+Form70!$H$109","999999=+Form70!$H$110"]
["999999=+Form71!$C$8","999999=+Form71!$C$7","999999=+Form71!$C$25","999999=+Form71!$E$4","999999=+Form71!$C$37","999999=+Form71!$C$24","999999=+Form71!$C$26","999999=+Form71!$F$26","999999=+Form71!$C$27","999999=+Form71!$C$38","999999=+Form71!$C$39","999999=+Form71!$C$40","999999=+Form71!$C$17","999999=+Form71!$C$18","999999=+Form71!$F$18","999999=+Form71!$C$19","999999=+Form71!$C$20","999999=+Form71!$E$20","999999=+Form71!$C$64","999999=+Form71!$C$66","999999=+Form71!$C$65","999999=+Form71!$C$67","999999=+Form71!$C$68","999999=+Form71!$C$60","999999=+Form71!$C$69","999999=+Form71!$C$70","999999=+Form71!$C$71","999999=+Form71!$I$48","999999=+Form71!$I$49","999999=+Form71!$I$50","999999=+Form71!$I$55","999999=+Form71!$J$55","999999=+Form71!$I$60","999999=+Form71!$I$61","999999=+Form71!$C$78","999999=+Form71!$C$79","999999=+Form71!$C$82","999999=+Form71!$C$126","999999=+Form71!$C$125","999999=+Form71!$C$124","999999=+Form71!$C$123","999999=+Form71!$C$95","999999=+Form71!$D$95","999999=+Form71!$C$96","999999=+Form71!$D$96","999999=+Form71!$C$97","999999=+Form71!$D$97","999999=+Form71!$D$98","999999=+Form71!$D$99","999999=+Form71!$D$100","999999=+Form71!$C$105","999999=+Form71!$D$105","999999=+Form71!$C$106","999999=+Form71!$D$106","999999=+Form71!$C$107","999999=+Form71!$D$107","999999=+Form71!$D$108","999999=+Form71!$D$109","999999=+Form71!$D$110","999999=+Form71!$E$95","999999=+Form71!$F$95","999999=+Form71!$E$96","999999=+Form71!$F$96","999999=+Form71!$E$97","999999=+Form71!$F$97","999999=+Form71!$F$98","999999=+Form71!$F$99","999999=+Form71!$F$100","999999=+Form71!$G$95","999999=+Form71!$H$95","999999=+Form71!$G$96","999999=+Form71!$H$96","999999=+Form71!$G$97","999999=+Form71!$H$97","999999=+Form71!$H$98","999999=+Form71!$H$99","999999=+Form71!$H$100",null,"999999=+Form71!$E$105","999999=+Form71!$F$105","999999=+Form71!$E$106","999999=+Form71!$F$106","999999=+Form71!$E$107","999999=+Form71!$F$107","999999=+Form71!$F$108","999999=+Form71!$F$109","999999=+Form71!$F$110","999999=+Form71!$G$105","999999=+Form71!$H$105","999999=+Form71!$G$106","999999=+Form71!$H$106","999999=+Form71!$G$107","999999=+Form71!$H$107","999999=+Form71!$H$108","999999=+Form71!$H$109","999999=+Form71!$H$110"]
["999999=+Form72!$C$8","999999=+Form72!$C$7","999999=+Form72!$C$25","999999=+Form72!$E$4","999999=+Form72!$C$37","999999=+Form72!$C$24","999999=+Form72!$C$26","999999=+Form72!$F$26","999999=+Form72!$C$27","999999=+Form72!$C$38","999999=+Form72!$C$39","999999=+Form72!$C$40","999999=+Form72!$C$17","999999=+Form72!$C$18","999999=+Form72!$F$18","999999=+Form72!$C$19","999999=+Form72!$C$20","999999=+Form72!$E$20","999999=+Form72!$C$64","999999=+Form72!$C$66","999999=+Form72!$C$65","999999=+Form72!$C$67","999999=+Form72!$C$68","999999=+Form72!$C$60","999999=+Form72!$C$69","999999=+Form72!$C$70","999999=+Form72!$C$71","999999=+Form72!$I$48","999999=+Form72!$I$49","999999=+Form72!$I$50","999999=+Form72!$I$55","999999=+Form72!$J$55","999999=+Form72!$I$60","999999=+Form72!$I$61","999999=+Form72!$C$78","999999=+Form72!$C$79","999999=+Form72!$C$82","999999=+Form72!$C$126","999999=+Form72!$C$125","999999=+Form72!$C$124","999999=+Form72!$C$123","999999=+Form72!$C$95","999999=+Form72!$D$95","999999=+Form72!$C$96","999999=+Form72!$D$96","999999=+Form72!$C$97","999999=+Form72!$D$97","999999=+Form72!$D$98","999999=+Form72!$D$99","999999=+Form72!$D$100","999999=+Form72!$C$105","999999=+Form72!$D$105","999999=+Form72!$C$106","999999=+Form72!$D$106","999999=+Form72!$C$107","999999=+Form72!$D$107","999999=+Form72!$D$108","999999=+Form72!$D$109","999999=+Form72!$D$110","999999=+Form72!$E$95","999999=+Form72!$F$95","999999=+Form72!$E$96","999999=+Form72!$F$96","999999=+Form72!$E$97","999999=+Form72!$F$97","999999=+Form72!$F$98","999999=+Form72!$F$99","999999=+Form72!$F$100","999999=+Form72!$G$95","999999=+Form72!$H$95","999999=+Form72!$G$96","999999=+Form72!$H$96","999999=+Form72!$G$97","999999=+Form72!$H$97","999999=+Form72!$H$98","999999=+Form72!$H$99","999999=+Form72!$H$100",null,"999999=+Form72!$E$105","999999=+Form72!$F$105","999999=+Form72!$E$106","999999=+Form72!$F$106","999999=+Form72!$E$107","999999=+Form72!$F$107","999999=+Form72!$F$108","999999=+Form72!$F$109","999999=+Form72!$F$110","999999=+Form72!$G$105","999999=+Form72!$H$105","999999=+Form72!$G$106","999999=+Form72!$H$106","999999=+Form72!$G$107","999999=+Form72!$H$107","999999=+Form72!$H$108","999999=+Form72!$H$109","999999=+Form72!$H$110"]
["999999=+Form73!$C$8","999999=+Form73!$C$7","999999=+Form73!$C$25","999999=+Form73!$E$4","999999=+Form73!$C$37","999999=+Form73!$C$24","999999=+Form73!$C$26","999999=+Form73!$F$26","999999=+Form73!$C$27","999999=+Form73!$C$38","999999=+Form73!$C$39","999999=+Form73!$C$40","999999=+Form73!$C$17","999999=+Form73!$C$18","999999=+Form73!$F$18","999999=+Form73!$C$19","999999=+Form73!$C$20","999999=+Form73!$E$20","999999=+Form73!$C$64","999999=+Form73!$C$66","999999=+Form73!$C$65","999999=+Form73!$C$67","999999=+Form73!$C$68","999999=+Form73!$C$60","999999=+Form73!$C$69","999999=+Form73!$C$70","999999=+Form73!$C$71","999999=+Form73!$I$48","999999=+Form73!$I$49","999999=+Form73!$I$50","999999=+Form73!$I$55","999999=+Form73!$J$55","999999=+Form73!$I$60","999999=+Form73!$I$61","999999=+Form73!$C$78","999999=+Form73!$C$79","999999=+Form73!$C$82","999999=+Form73!$C$126","999999=+Form73!$C$125","999999=+Form73!$C$124","999999=+Form73!$C$123","999999=+Form73!$C$95","999999=+Form73!$D$95","999999=+Form73!$C$96","999999=+Form73!$D$96","999999=+Form73!$C$97","999999=+Form73!$D$97","999999=+Form73!$D$98","999999=+Form73!$D$99","999999=+Form73!$D$100","999999=+Form73!$C$105","999999=+Form73!$D$105","999999=+Form73!$C$106","999999=+Form73!$D$106","999999=+Form73!$C$107","999999=+Form73!$D$107","999999=+Form73!$D$108","999999=+Form73!$D$109","999999=+Form73!$D$110","999999=+Form73!$E$95","999999=+Form73!$F$95","999999=+Form73!$E$96","999999=+Form73!$F$96","999999=+Form73!$E$97","999999=+Form73!$F$97","999999=+Form73!$F$98","999999=+Form73!$F$99","999999=+Form73!$F$100","999999=+Form73!$G$95","999999=+Form73!$H$95","999999=+Form73!$G$96","999999=+Form73!$H$96","999999=+Form73!$G$97","999999=+Form73!$H$97","999999=+Form73!$H$98","999999=+Form73!$H$99","999999=+Form73!$H$100",null,"999999=+Form73!$E$105","999999=+Form73!$F$105","999999=+Form73!$E$106","999999=+Form73!$F$106","999999=+Form73!$E$107","999999=+Form73!$F$107","999999=+Form73!$F$108","999999=+Form73!$F$109","999999=+Form73!$F$110","999999=+Form73!$G$105","999999=+Form73!$H$105","999999=+Form73!$G$106","999999=+Form73!$H$106","999999=+Form73!$G$107","999999=+Form73!$H$107","999999=+Form73!$H$108","999999=+Form73!$H$109","999999=+Form73!$H$110"]
["999999=+Form74!$C$8","999999=+Form74!$C$7","999999=+Form74!$C$25","999999=+Form74!$E$4","999999=+Form74!$C$37","999999=+Form74!$C$24","999999=+Form74!$C$26","999999=+Form74!$F$26","999999=+Form74!$C$27","999999=+Form74!$C$38","999999=+Form74!$C$39","999999=+Form74!$C$40","999999=+Form74!$C$17","999999=+Form74!$C$18","999999=+Form74!$F$18","999999=+Form74!$C$19","999999=+Form74!$C$20","999999=+Form74!$E$20","999999=+Form74!$C$64","999999=+Form74!$C$66","999999=+Form74!$C$65","999999=+Form74!$C$67","999999=+Form74!$C$68","999999=+Form74!$C$60","999999=+Form74!$C$69","999999=+Form74!$C$70","999999=+Form74!$C$71","999999=+Form74!$I$48","999999=+Form74!$I$49","999999=+Form74!$I$50","999999=+Form74!$I$55","999999=+Form74!$J$55","999999=+Form74!$I$60","999999=+Form74!$I$61","999999=+Form74!$C$78","999999=+Form74!$C$79","999999=+Form74!$C$82","999999=+Form74!$C$126","999999=+Form74!$C$125","999999=+Form74!$C$124","999999=+Form74!$C$123","999999=+Form74!$C$95","999999=+Form74!$D$95","999999=+Form74!$C$96","999999=+Form74!$D$96","999999=+Form74!$C$97","999999=+Form74!$D$97","999999=+Form74!$D$98","999999=+Form74!$D$99","999999=+Form74!$D$100","999999=+Form74!$C$105","999999=+Form74!$D$105","999999=+Form74!$C$106","999999=+Form74!$D$106","999999=+Form74!$C$107","999999=+Form74!$D$107","999999=+Form74!$D$108","999999=+Form74!$D$109","999999=+Form74!$D$110","999999=+Form74!$E$95","999999=+Form74!$F$95","999999=+Form74!$E$96","999999=+Form74!$F$96","999999=+Form74!$E$97","999999=+Form74!$F$97","999999=+Form74!$F$98","999999=+Form74!$F$99","999999=+Form74!$F$100","999999=+Form74!$G$95","999999=+Form74!$H$95","999999=+Form74!$G$96","999999=+Form74!$H$96","999999=+Form74!$G$97","999999=+Form74!$H$97","999999=+Form74!$H$98","999999=+Form74!$H$99","999999=+Form74!$H$100",null,"999999=+Form74!$E$105","999999=+Form74!$F$105","999999=+Form74!$E$106","999999=+Form74!$F$106","999999=+Form74!$E$107","999999=+Form74!$F$107","999999=+Form74!$F$108","999999=+Form74!$F$109","999999=+Form74!$F$110","999999=+Form74!$G$105","999999=+Form74!$H$105","999999=+Form74!$G$106","999999=+Form74!$H$106","999999=+Form74!$G$107","999999=+Form74!$H$107","999999=+Form74!$H$108","999999=+Form74!$H$109","999999=+Form74!$H$110"]
["999999=+Form75!$C$8","999999=+Form75!$C$7","999999=+Form75!$C$25","999999=+Form75!$E$4","999999=+Form75!$C$37","999999=+Form75!$C$24","999999=+Form75!$C$26","999999=+Form75!$F$26","999999=+Form75!$C$27","999999=+Form75!$C$38","999999=+Form75!$C$39","999999=+Form75!$C$40","999999=+Form75!$C$17","999999=+Form75!$C$18","999999=+Form75!$F$18","999999=+Form75!$C$19","999999=+Form75!$C$20","999999=+Form75!$E$20","999999=+Form75!$C$64","999999=+Form75!$C$66","999999=+Form75!$C$65","999999=+Form75!$C$67","999999=+Form75!$C$68","999999=+Form75!$C$60","999999=+Form75!$C$69","999999=+Form75!$C$70","999999=+Form75!$C$71","999999=+Form75!$I$48","999999=+Form75!$I$49","999999=+Form75!$I$50","999999=+Form75!$I$55","999999=+Form75!$J$55","999999=+Form75!$I$60","999999=+Form75!$I$61","999999=+Form75!$C$78","999999=+Form75!$C$79","999999=+Form75!$C$82","999999=+Form75!$C$126","999999=+Form75!$C$125","999999=+Form75!$C$124","999999=+Form75!$C$123","999999=+Form75!$C$95","999999=+Form75!$D$95","999999=+Form75!$C$96","999999=+Form75!$D$96","999999=+Form75!$C$97","999999=+Form75!$D$97","999999=+Form75!$D$98","999999=+Form75!$D$99","999999=+Form75!$D$100","999999=+Form75!$C$105","999999=+Form75!$D$105","999999=+Form75!$C$106","999999=+Form75!$D$106","999999=+Form75!$C$107","999999=+Form75!$D$107","999999=+Form75!$D$108","999999=+Form75!$D$109","999999=+Form75!$D$110","999999=+Form75!$E$95","999999=+Form75!$F$95","999999=+Form75!$E$96","999999=+Form75!$F$96","999999=+Form75!$E$97","999999=+Form75!$F$97","999999=+Form75!$F$98","999999=+Form75!$F$99","999999=+Form75!$F$100","999999=+Form75!$G$95","999999=+Form75!$H$95","999999=+Form75!$G$96","999999=+Form75!$H$96","999999=+Form75!$G$97","999999=+Form75!$H$97","999999=+Form75!$H$98","999999=+Form75!$H$99","999999=+Form75!$H$100",null,"999999=+Form75!$E$105","999999=+Form75!$F$105","999999=+Form75!$E$106","999999=+Form75!$F$106","999999=+Form75!$E$107","999999=+Form75!$F$107","999999=+Form75!$F$108","999999=+Form75!$F$109","999999=+Form75!$F$110","999999=+Form75!$G$105","999999=+Form75!$H$105","999999=+Form75!$G$106","999999=+Form75!$H$106","999999=+Form75!$G$107","999999=+Form75!$H$107","999999=+Form75!$H$108","999999=+Form75!$H$109","999999=+Form75!$H$110"]

{"sheet":"Headings","index":6,"n_rows":166,"n_cols":4,"rows_kept":166,"cut":false,"hidden":true,"merged":[]}
[null,"English"]
[null,"English","French"]
[]
[null,"Applications for Educational Programs: Education and Community Partnership Program","Demande de programmes éducatifs : Programmes de parternariats pour l'éducation avec les établissements communautaires"]
[null,"(Grants for Student Needs Regulation)","(Somme liée aux établissements)"]
[null,"2021-22","2021-22","Update the French"]
[null,"1. Board Information","1. Information du conseil"]
[null,"DSB\n(Select from list)","CSD\n(sélectionner de la liste)"]
[null,"Board","No du conseil"]
[null,"Name of DSB","Nom du conseil"]
[null,"Superintendent","Surintendant(e)"]
[null,"E-mail Address","Adresse courriel"]
[null,"Board Contact","Personne ressource au conseil"]
[null,"Telephone","No de téléphone"]
[null,"Ext:","Poste :"]
[null,"2. Agency","2. Organisme"]
[null,"Name","Nom de l'organisme"]
[null,"Address","Adresse"]
[null,"Postal Code","Code postal"]
[null,"3. Facility","3. L'établissement"]
[null,"Name","Nom de l'établissement"]
[null,"BSID","NIM"]
[null,"New #","Nouveau numéro"]
[null,"Contact Name","Personne ressource"]
[null,"# Agency Staff on Site","Nbre d'employés de l'organisme sur place"]
[null,"# Agency Staff in Classroom","Nbre d'employés de l'organisme en classe"]
[null,"# of Residential Beds/\nOperational Bed Capacity","Nbre de lits en programme résidentiel/\nNombre maximum de lits disponibles"]
[null,"PTR (According to agreement)","REE  (selon l'entente)"]
[null,"5. Education Programs Enrolment: FTE","5. L'effectif du programme d'éducation : ETP"]
[null,"Actual\n2020-21","Réel\n2020-21"]
[null,"Projected\n2021-22","Prévisions\n2021-22"]
[null,"September","septembre"]
[null,"October","octobre"]
[null,"November","novembre"]
[null,"December","décembre"]
[null,"January","janvier"]
[null,"February","février"]
[null,"March","mars"]
[null,"April","avril"]
[null,"May ","mai"]
[null,"June","juin"]
[null,"July","juillet"]
[null,"August","août"]
[null,"(Application for Liaison/Administration has no enrolment data)","(Il n'y a pas de donnée des effectifs sur la demande du personnel de liaision/administration)"]
[null,"4. Type of Application & Facility","4. Type d'établissement et de demande"]
[null,"Note: Program Description should include a statement of the treatment philosophy, the role of the agency staff, and an explanation of how the treatment and educational staff work together. The designated PTR should be clearly indicated.","Note: La description du programme doit inclure un énoncé sur la philosophie des traitements, le rôle du personnel de l'organisme, et expliquer comment le traitement et le personnel éducatif travaillent ensemble. Le REE désigné doit être clairement indiqué."]
[null,"Application Type","Type de demande"]
[null,"Program Changes Other than 1% Increase in Salaries","Changements au programme autres que une augmentation des salaires de 1%"]
[null,"Attachments","Pièces jointes"]
[null,"Facility Type","Type d'établissement"]
[null,"6. Panel","6. Palier"]
[null,"Division Type","Cycle"]
[null,"Duration","Durée "]
[null,"# of Instructional Days","Nbre de journées d'enseignement"]
[null,"Language of Instruction","Langue d'enseignement  "]
[null,"# of Classrooms in DSB Schools","Nbre de classes dans les écoles du CSD"]
[null,"# of Classrooms not in DSB Schools","Nbre de classes qui ne sont pas dans les écoles du CSD"]
[null,"Note: Application for Liaison/Administrator should have no classroom data.","Note: Demande de personnel pour les postes d'administration ou de liaison  ne doit pas inclure de données sur les effectifs "]
[null,"8. Request for Approval","8. Demande d'approbation"]
[null,"Salaries and Benefits","Salaires et avantages sociaux"]
[null,"Teachers","Enseignants(es)"]
[null,"Educational Assistants","Aides-enseignants(es)"]
[null,"Program Amount","Somme pour dispenser le programme"]
[null,"Furniture and Equipment","Mobilier et équipement"]
[null,"October\n2020-21","octobre\n2020-21"]
[null,"Projected\n2021-22","Prévisions\n2021-22"]
[null,"March Approval \n2021-22","Approbation de mars\n2021-22"]
[null,"October Approval\n2021-22","Approbation de octobre\n2021-22"]
[null,"Actual\n2021-22","Réel\n2021-22"]
[null,"7. Statistical Information","7. Information pour fins de statistiques"]
[null,"Total FTE","ETP Total"]
[null,"Average Monthly FTE","ETP moyen mensuel"]
[null,"PTR","REE "]
[null,"Status","Statut de la demande"]
[null,"Monitoring Year","Année de monitorage par le ministère              "]
[null,"Reviewed by Education Officer","Révisé par l'agent/l'agente d'éducation"]
[null,"Regional Office","Bureau régional"]
[null,"(Information received is subject to review or audit.)","(L'information reçue est soumise à une révision/vérification.)"]
[]
[null,"Actual\n2020-21","Réel\n2020-21"]
[null,"Projected\n2021-22","Prévisions\n2021-22"]
[null,"Actual\n2021-22","Réel\n2021-22"]
[]
[null,"Address 2","Adresse 2"]
[null,"Facility","L'établissement"]
[null,"Year","Année"]
[]
[null,"# of \nfunded staff \nin program","Dotation du \npersonnel selon \nle financement","X"]
[]
[null,"(Note: # must begin with 64)","(Noter : Numéro doit débuter par 64)"]
[]
[null,"Funding Ministry\n(Select from list)","Ministère qui subventionne\n(sélectionnez de la liste)"]
[null,"Identify additional ministry, if applicable","Identifier un ministère supplémentaire (le cas échéant)"]
[null,"Note: Agreements must be forwarded to the Regional Office. Information received is subject to review or audit.","Remarque : Les ententes doivent être envoyées au bureau régional. L'information reçue est soumise à une révision/vérification."]
[]
[null,"From Grade","De l'année d'études :"]
[null,"To Grade","à l'année d'études :"]
[]
[]
[null,"Care and/or Treatment Focus of the Facility","Point de mire de l’établissement de soins et/ou traitement"]
[null,"October Approval \n2021-22","Approbation de octobre\n2021-22"]
[null,"Operated By ","Géré par: "]
[null,"# of Funded Spaces","Nbre d'espaces financés"]
[null,"Type","Type"]
[null,"as of Oct 31st, 2020","En date du 31 octobre 2020"]
[null,"as of Oct 31st, 2021","En date du 31  octobre 2021"]
[null,"Actual\n2020-21 $","Réel\n2020-21 $"]
[null,"Actual\n2021-22","Réel\n2021-22"]
[null,"October Approval\n2021-22","Approbation de octobre\n2021-22"]
[]
[]
[null,"Application Form Number","Numéro du formulaire de demande"]
[]
[null,"Type of Student served","Type d’élèves servis"]
[null,"Please specify if \"other\" is selected","Veuillez préciser :"]
[]
[null,"Partner DSBs Name","Conseils scolaires de district partenaire"]
[]
[null,"# of Day Treatment Spaces","Nbre de places au programme de jour"]
[null,"# of Hospital Beds","Nbre de lits d’hôpitaux"]
[]
[null,"Setting","Milieu"]
[null,"Program Description for New Programs","Description pour un nouveau programme","x"]
[]
[null,"BSID","NIM"]
[null,"Location","Emplacement"]
[]
[null,"Please Complete Appendix A: Program Description","Veuillez remplir l'Annexe A : Description du programme"]
[null,"#","Nbre "]
[]
[null,"9. Notifications","9. Avis"]
[null,"FOR OFFICE USE ONLY","À l’usage interne seulement"]
[null,"Approval and Signoff","Approbation et signature"]
[null,"Education Officer Notes","Notes de l’agente ou l’agent d’éducation"]
[null,"Previous Year","Années précédentes"]
[null,"Projections","Prévisions"]
[null,"Projection Approval","Approbation des projections"]
[null,"Actuals","Réel"]
[null,"Actual Approvals","Approbation des réels"]
[]
[null,"MINISTRY REGIONAL OFFICE ONLY","Bureau régional du ministère seulement"]
[null,"CHECK NOTIFICATION BOX IN SECTION 9","Cochez la boîte d’avis dans la section 9"]
[null,"Hours of Instruction","Heures d’instruction"]
[null,"Other Salaries (EET)","Autres salaires (ETA)"]
[null,"Program Attendance Expectations","Attentes à l’égard de la fréquentation du programme"]
[null,"Total Number of Students Served Last Year","Nombre total d’élèves servis l'année dernière"]
[]
[]
[]
[]
[]
[null,"5. a) Program Type and Primary Need/Cluster ","5. a) Type de programme et besoin primaire/groupement"]
[null,"* Note: Refer to Instructions for CTCC Application Form 2021-22 for a breakdown of working definitions of Program Types and Primary Need/Cluster","* Remarque : Référez-vous aux Instructions relatives au formulaire de demande du STGC 2021-22 pour obtenir les détails des définitions de travail des types de programme et du besoin primaire/groupement"]
[]
[null,"Program Type","Type de programme"]
[null,"Program Sub-Type","Sous-type de programme"]
[null,"Primary Need/Cluster","Besoin primaire/groupement"]
[]
[null,"5. b) Admissions & Transitions","5. b) Admissions et transitions"]
[null,"Referral Sources (select all that apply)","Sources de références (sélectionnez toutes celles qui s’appliquent)"]
[null,"If \"Other\" was selected, please explain:","Si vous avez sélectionné « Autre », veuillez nous fournir davantage de renseignements :"]
[]
[]
[null,"Is there a waitlist?","Est-ce qu’il y a une liste d’attente d’élèves?"]
[null,"# of Children/Youth on Wait List","Nombre d’enfants/jeunes sur la liste d’attente"]
[null,"Admissions decision-making","Prise de décisions relative aux admissions"]

{"sheet":"Lists","index":7,"n_rows":67,"n_cols":16,"rows_kept":67,"cut":false,"hidden":true,"merged":[]}
[]
[]
[null,"Mental Health and Wellbeing"]
[null,"Physical Health and Exceptionalities"]
[null,"Custody and Correctional Youth Justice Programs"]
[]
[]
[null,"Mental Health and Substance Use"]
[null,"Mental Health Promotion"]
[null,"Well-being"]
[null,"N/A"]
[null,"Youth Justice",null,null,null,null,null,"Education sector",null,null,null,null,"Secteur de l’éducation"]
[null,"Adult Justice",null,null,null,null,null,"Health sector (hospital)",null,null,null,null,"Secteur de la santé (hôpital)"]
[null,null,null,null,null,null,null,"Self-referral",null,null,null,null,"Accès direct"]
[null,null,null,null,null,null,null,"Community-based agencies (mental health)",null,null,null,null,"Organismes établis dans la collectivité (santé mentale)"]
[null,null,null,null,null,null,null,"Parent/Guardian",null,null,null,null,"Parent/Tuteur"]
[null,null,null,null,null,null,null,"Justice Service",null,null,null,null,"Services de justice"]
[null,"Mental Health",null,null,null,null,null,"Other",null,null,null,null,"Autre"]
[null,"Mental Illness"]
[null,"Substance Use"]
[null,"Mental Health and Substance Use"]
[null,"Social Emotional and Behavioural Challenges",null,null,null,null,null,"Yes",null,"Oui"]
[null,"Young Parent",null,null,null,null,null,"No",null,"Non"]
[null,"Youth in Care",null,null,null,null,null,"Unknown",null,"Inconnu"]
[null,"Alternative Programs for Vulnerable Youth"]
[null,"Alternative Program for Indigenous Youth"]
[null,"Rehabilitation (OT, PT)"]
[null,"Physical Medical condition(s)",null,null,null,null,null,null,"Facility only",null,null,null,null,null,null,"Établissement seulement"]
[null,"Special Education Needs and/or Exceptionality focus",null,null,null,null,null,null,"School board only",null,null,null,null,null,null,"Conseil scolaire seulement"]
[null,"Open Custody/detention centre",null,null,null,null,null,null,"Facility and School board joint decision",null,null,null,null,null,null,"Décision commune de l'établissement et du conseil scolaire"]
[null,"Secure Custody/detention centre",null,null,null,null,null,null,"Selection committee/multidisciplinary admission committee",null,null,null,null,null,null,"Comité de sélection/comité d’admission multidisciplinaire"]
[null,"Community based youth justice"]
[null,"Corrections"]
[]
[]
[]
[]
[null,"Santé mentale et bien-être"]
[null,"Santé physique et anomalies"]
[null,"Programmes de justice pour la jeunesse – services de garde et services correctionnels"]
[]
[null,"Santé mentale et abus de substances"]
[null,"Promotion de la santé mentale"]
[null,"Bien-être"]
[null,"S. o."]
[null,"Justice pour la jeunesse"]
[null,"Justice pour les adultes"]
[]
[]
[]
[]
[null,"Santé mentale"]
[null,"Maladies mentales"]
[null,"Abus de substances."]
[null,"Santé mentale et abus de substances"]
[null,"Défis sur le plan socio-émotionnel et comportemental"]
[null,"Jeune parent"]
[null,"Jeune pris en charge"]
[null,"Programmes alternatifs pour jeunes vulnérables"]
[null,"Programmes alternatifs pour jeunes autochtones"]
[null,"Réhabilitation (ergothérapie, physiothérapie)"]
[null,"Problèmes médicaux physiques"]
[null,"Besoins spéciaux en matière d’éducation ou axées sur les anomalies"]
[null,"Garde ouverte/centre de détention"]
[null,"Garde fermée/centre de détention"]
[null,"Justice pour la jeunesse dans la collectivité"]
[null,"Services correctionnels"]

{"sheet":"Notes","index":8,"n_rows":10,"n_cols":3,"rows_kept":10,"cut":false,"hidden":true,"merged":[]}
[]
[]
[null,"PTR","Only a whole number."]
[null,null,"Min and Max, 4 and 20 respectively"]
[]
[null,null,"Field is Now Frozen, so blank entries will have to request approval to change during the Approval Process"]
[]
[null,"Total Number of Students Served","Field protection should be updated"]
[]
[null,"Program Amount","Needs to be built in for L/A Positions"]